Target
Transient receptor potential cation channel subfamily A member 1
Ligand
BDBM481859
Substrate
Meas. Tech.
FLIPR Assay
IC50
29.6±n/a nM
Citation
 Chen, HShore, DVillemure, EVolgraf, MHu, BLu, ACridland, AWard, SBeaumier, FDery, MLarouche-Gauthier, R Oxadiazolones as transient receptor potential channel inhibitors US Patent  US10913742 Publication Date 2/9/2021 
Target
Name:
Transient receptor potential cation channel subfamily A member 1
Synonyms:
ANKTM1 TRPA1 Transformation-sensitive protein p120 | Transient receptor potential cation channel subfamily A member 1 (TRPA1)
Type:
Protein
Mol. Mass.:
127514.20
Organism:
Homo sapiens (Human)
Description:
O75762
Residue:
1119
  
Inhibitor
Name:
BDBM481859
Synonyms:
3-[3-(4-chlorophenyl)-3- fluoro-cyclobutyl]-5-[(5- methyl-4-oxo-pyrido[2,3- d]pyrimidin-3-yl)methyl]- 1,3,4-oxadiazol-2-one | US10913742, Example 104
Type:
Small organic molecule
Emp. Form.:
C21H17ClFN5O3
Mol. Mass.:
441.843
SMILES:
Cc1ccnc2ncn(Cc3nn([C@H]4C[C@@](F)(C4)c4ccc(Cl)cc4)c(=O)o3)c(=O)c12
: