Target
Transient receptor potential cation channel subfamily A member 1
Ligand
BDBM481868
Substrate
Meas. Tech.
FLIPR Assay
IC50
17.8±n/a nM
Citation
 Chen, HShore, DVillemure, EVolgraf, MHu, BLu, ACridland, AWard, SBeaumier, FDery, MLarouche-Gauthier, R Oxadiazolones as transient receptor potential channel inhibitors US Patent  US10913742 Publication Date 2/9/2021 
Target
Name:
Transient receptor potential cation channel subfamily A member 1
Synonyms:
ANKTM1 TRPA1 Transformation-sensitive protein p120 | Transient receptor potential cation channel subfamily A member 1 (TRPA1)
Type:
Protein
Mol. Mass.:
127514.20
Organism:
Homo sapiens (Human)
Description:
O75762
Residue:
1119
  
Inhibitor
Name:
BDBM481868
Synonyms:
5-[(7-methyl-6-oxo-purin-1- yl)methyl]-3-[3-(2- naphthyl)cyclobutyl]-1,3,4- oxadiazol-2-one | US10913742, Example 113
Type:
Small organic molecule
Emp. Form.:
C23H20N6O3
Mol. Mass.:
428.4433
SMILES:
Cn1cnc2ncn(Cc3nn([C@H]4C[C@@H](C4)c4ccc5ccccc5c4)c(=O)o3)c(=O)c12
: