Target
Monoglyceride lipase
Ligand
BDBM483684
Substrate
Meas. Tech.
In Vitro Competitive Activity-Based Protein Profiling
IC50
<100±n/a nM
Citation
 Grice, CAWiener, JJWeber, ODDuncan, KK Pyrazole MAGL inhibitors US Patent  US10927105 Publication Date 2/23/2021 
Target
Name:
Monoglyceride lipase
Synonyms:
HU-K5 Lysophospholipase-like MGL MGLL_HUMAN
Type:
Hydrolase
Mol. Mass.:
33264.56
Organism:
Homo sapiens (Human)
Description:
Human recombinant MGL (Cayman Chemical, cat# 10008354).
Residue:
303
  
Inhibitor
Name:
BDBM483684
Synonyms:
1-(4-(3-(4- chlorophenoxy)- benzyl)- piperazine-1- carbonyl)-4-methyl- 1H-pyrazole-3- carboxylic acid US11655217, Example 129
Type:
Small organic molecule
Emp. Form.:
C23H23ClN4O4
Mol. Mass.:
454.906
SMILES:
Cc1cn(nc1C(O)=O)C(=O)N1CCN(Cc2cccc(Oc3ccc(Cl)cc3)c2)CC1
: