Target
Mitogen-activated protein kinase kinase kinase kinase 1
Ligand
BDBM414609
Substrate
Meas. Tech.
Kinase Binding Assay
Ki
<100±n/a nM
Citation
 Vechorkin, OLiu, KSokolsky, AWang, AYe, HFYe, QYao, W Pyrazolopyridine compounds and uses thereof US Patent  US10934288 Publication Date 3/2/2021 
Target
Name:
Mitogen-activated protein kinase kinase kinase kinase 1
Synonyms:
HPK1 MAP4K1
Type:
PROTEIN
Mol. Mass.:
91316.07
Organism:
Homo sapiens (Human)
Description:
ChEMBL_586597
Residue:
833
  
Inhibitor
Name:
BDBM414609
Synonyms:
US10435405, Example 26 | US10934288, Example 26
Type:
Small organic molecule
Emp. Form.:
C25H25FN6O2
Mol. Mass.:
460.5034
SMILES:
COc1cccc(F)c1-c1cc2c(NC(=O)c3ccc(cc3)N3CCN(C)CC3)n[nH]c2cn1
: