Target
Mitogen-activated protein kinase kinase kinase kinase 1
Ligand
BDBM414813
Substrate
Meas. Tech.
Kinase Binding Assay
Ki
<100±n/a nM
Citation
 Vechorkin, OLiu, KSokolsky, AWang, AYe, HFYe, QYao, W Pyrazolopyridine compounds and uses thereof US Patent  US10934288 Publication Date 3/2/2021 
Target
Name:
Mitogen-activated protein kinase kinase kinase kinase 1
Synonyms:
HPK1 MAP4K1
Type:
PROTEIN
Mol. Mass.:
91316.07
Organism:
Homo sapiens (Human)
Description:
ChEMBL_586597
Residue:
833
  
Inhibitor
Name:
BDBM414813
Synonyms:
US10435405, Example 230 | US10934288, Example 230
Type:
Small organic molecule
Emp. Form.:
C23H25FN6
Mol. Mass.:
404.4832
SMILES:
CCn1cc(cn1)-c1n[nH]c2cnc(cc12)-c1c(C)cc(cc1F)[C@@H]1CCCCN1
: