Target
Mitogen-activated protein kinase kinase kinase kinase 1
Ligand
BDBM414823
Substrate
Meas. Tech.
Kinase Binding Assay
Ki
<100±n/a nM
Citation
 Vechorkin, OLiu, KSokolsky, AWang, AYe, HFYe, QYao, W Pyrazolopyridine compounds and uses thereof US Patent  US10934288 Publication Date 3/2/2021 
Target
Name:
Mitogen-activated protein kinase kinase kinase kinase 1
Synonyms:
HPK1 MAP4K1
Type:
PROTEIN
Mol. Mass.:
91316.07
Organism:
Homo sapiens (Human)
Description:
ChEMBL_586597
Residue:
833
  
Inhibitor
Name:
BDBM414823
Synonyms:
US10435405, Example 240 | US10934288, Example 240
Type:
Small organic molecule
Emp. Form.:
C27H30FN7
Mol. Mass.:
471.5724
SMILES:
CNC1CCCc2c1ccc(F)c2-c1cc2c(n[nH]c2cn1)-c1ccc(nc1)N1CCN(C)CC1
: