Target
Mitogen-activated protein kinase kinase kinase kinase 1
Ligand
BDBM414824
Substrate
Meas. Tech.
Kinase Binding Assay
Ki
<100±n/a nM
Citation
 Vechorkin, OLiu, KSokolsky, AWang, AYe, HFYe, QYao, W Pyrazolopyridine compounds and uses thereof US Patent  US10934288 Publication Date 3/2/2021 
Target
Name:
Mitogen-activated protein kinase kinase kinase kinase 1
Synonyms:
HPK1 MAP4K1
Type:
PROTEIN
Mol. Mass.:
91316.07
Organism:
Homo sapiens (Human)
Description:
ChEMBL_586597
Residue:
833
  
Inhibitor
Name:
BDBM414824
Synonyms:
US10435405, Example 241 | US10934288, Example 241
Type:
Small organic molecule
Emp. Form.:
C27H29FN6
Mol. Mass.:
456.5578
SMILES:
CN1CCN(CC1)c1ccc(cc1)-c1n[nH]c2cnc(cc12)-c1c(F)ccc2C(N)CCCc12
: