Target
Diacylglycerol O-acyltransferase 2
Ligand
BDBM486390
Substrate
Meas. Tech.
DGAT2 Enzymatic Activity Assay
IC50
664±n/a nM
Citation
 Shen, DGraham, THJiang, JDing, FTudge, C Indole derivatives useful as inhibitors of diacylglyceride O-acyltransferase 2 US Patent  US10947222 Publication Date 3/16/2021 
Target
Name:
Diacylglycerol O-acyltransferase 2
Synonyms:
ARAT DGAT2 Diacylglycerol O-acyltransferase 2 (DGAT2) Retinol O-fatty-acyltransferase
Type:
Multi-pass membrane protein
Mol. Mass.:
43848.90
Organism:
Homo sapiens (Human)
Description:
Q96PD7
Residue:
388
  
Inhibitor
Name:
BDBM486390
Synonyms:
N-(1,1- dioxidotetrahydrothiophen-3- yl)-1-(4-fluorophenyl)-3- (pyridin-2-yl)-1H-indole-6- carboxamide (racemic) | US10947222, Example 22
Type:
Small organic molecule
Emp. Form.:
C24H20FN3O3S
Mol. Mass.:
449.497
SMILES:
Fc1ccc(cc1)-n1cc(-c2ccccn2)c2ccc(cc12)C(=O)NC1CCS(=O)(=O)C1
: