Target
Tyrosine-protein kinase SYK [342-635]
Ligand
BDBM140387
Substrate
Meas. Tech.
GSK 3beta Kinase-Test
IC50
6.00±n/a nM
Citation
 Dahmann, GHoffmann, MKlicic Badoux, JLamb, DJMcCarthy, CNapier, SCParrish, KScott, JFitzgerald, JLWalker, E Heteroaryl SYK inhibitors US Patent  US10947243 Publication Date 3/16/2021 
Target
Name:
Tyrosine-protein kinase SYK [342-635]
Synonyms:
KSYK_HUMAN SYK (aa 342-635)
Type:
Enzyme Catalytic Domain
Mol. Mass.:
34105.36
Organism:
Homo sapiens (Human)
Description:
P43405[342-635]
Residue:
294
  
Inhibitor
Name:
BDBM140387
Synonyms:
US10947243, Example 112 US9914735, Example 112
Type:
Small organic molecule
Emp. Form.:
C20H22N4O2
Mol. Mass.:
350.4143
SMILES:
C[C@@H](Oc1cc(cc2ncccc12)-c1cnn(C)c1C)[C@H]1CNC(=O)C1
: