Target
Tyrosine-protein kinase SYK [342-635]
Ligand
BDBM140369
Substrate
Meas. Tech.
GSK 3beta Kinase-Test
IC50
1.000±n/a nM
Citation
 Dahmann, GHoffmann, MKlicic Badoux, JLamb, DJMcCarthy, CNapier, SCParrish, KScott, JFitzgerald, JLWalker, E Heteroaryl SYK inhibitors US Patent  US10947243 Publication Date 3/16/2021 
Target
Name:
Tyrosine-protein kinase SYK [342-635]
Synonyms:
KSYK_HUMAN SYK (aa 342-635)
Type:
Enzyme Catalytic Domain
Mol. Mass.:
34105.36
Organism:
Homo sapiens (Human)
Description:
P43405[342-635]
Residue:
294
  
Inhibitor
Name:
BDBM140369
Synonyms:
US10947243, Example 94 US9914735, Example 94
Type:
Small organic molecule
Emp. Form.:
C23H22N4O2
Mol. Mass.:
386.4464
SMILES:
C[C@@H](Oc1cc(cc2ncccc12)-c1ccc2n(C)cnc2c1)[C@H]1CNC(=O)C1
: