Target
Tyrosine-protein kinase SYK [342-635]
Ligand
BDBM375939
Substrate
Meas. Tech.
GSK 3beta Kinase-Test
IC50
7.00±n/a nM
Citation
 Dahmann, GHoffmann, MKlicic Badoux, JLamb, DJMcCarthy, CNapier, SCParrish, KScott, JFitzgerald, JLWalker, E Heteroaryl SYK inhibitors US Patent  US10947243 Publication Date 3/16/2021 
Target
Name:
Tyrosine-protein kinase SYK [342-635]
Synonyms:
KSYK_HUMAN SYK (aa 342-635)
Type:
Enzyme Catalytic Domain
Mol. Mass.:
34105.36
Organism:
Homo sapiens (Human)
Description:
P43405[342-635]
Residue:
294
  
Inhibitor
Name:
BDBM375939
Synonyms:
US10947243, Example 2 | US9914735, Example 2
Type:
Small organic molecule
Emp. Form.:
C20H26N6O2
Mol. Mass.:
382.4594
SMILES:
C[C@@H](Oc1nc(cc2nn(C)cc12)-c1cnn(c1)C(C)(C)C)[C@H]1CNC(=O)C1
: