Target
Tyrosine-protein kinase SYK [342-635]
Ligand
BDBM375940
Substrate
Meas. Tech.
GSK 3beta Kinase-Test
IC50
12.2±n/a nM
Citation
 Dahmann, GHoffmann, MKlicic Badoux, JLamb, DJMcCarthy, CNapier, SCParrish, KScott, JFitzgerald, JLWalker, E Heteroaryl SYK inhibitors US Patent  US10947243 Publication Date 3/16/2021 
Target
Name:
Tyrosine-protein kinase SYK [342-635]
Synonyms:
KSYK_HUMAN SYK (aa 342-635)
Type:
Enzyme Catalytic Domain
Mol. Mass.:
34105.36
Organism:
Homo sapiens (Human)
Description:
P43405[342-635]
Residue:
294
  
Inhibitor
Name:
BDBM375940
Synonyms:
US10947243, Example 3 | US9914735, Example 3
Type:
Small organic molecule
Emp. Form.:
C21H26N6O3
Mol. Mass.:
410.4695
SMILES:
C[C@@H](Oc1nc(cc2nn(C)cc12)-c1cnn(c1)C1CCCCO1)[C@H]1CNC(=O)C1
: