Target
Vascular endothelial growth factor receptor 2
Ligand
BDBM488466
Substrate
Meas. Tech.
Enzyme Assay
IC50
3000±n/a nM
Citation
 Jordan, AMNewton, RWaszkowycz, BSutton, JMHynd, GPaoletta, SFordyce, EA Heterocyclic compounds as ret kinase inhibitors US Patent  US10954241 Publication Date 3/23/2021 
Target
Name:
Vascular endothelial growth factor receptor 2
Synonyms:
CD_antigen=CD309 Fetal liver kinase 1 (FLK-1) KDR Protein-tyrosine kinase receptor Flk-1 VEGFR-2 VEGFR2 Vascular Endothelial Growth Factor Receptor Kinase 2 Vascular endothelial growth factor receptor 2 (KDR) Vascular endothelial growth factor receptor 2 (VEGFR2) Vascular endothelial growth factor receptor-2 (VEGFR-2)
Type:
Receptor Tyrosine Kinase
Mol. Mass.:
151510.97
Organism:
Homo sapiens (Human)
Description:
P35968
Residue:
1356
  
Inhibitor
Name:
BDBM488466
Synonyms:
1-Isopropyl-3-[6-(1,3,4-thiadiazol-2-yl)-1H-indol- 2-yl]pyrazolo[3,4-d]pyrimidin-4-amine US11548896, Example 106
Type:
Small organic molecule
Emp. Form.:
C18H16N8S
Mol. Mass.:
376.438
SMILES:
CC(C)n1nc(-c2cc3ccc(cc3[nH]2)-c2nncs2)c2c(N)ncnc12
: