Target
Tyrosine-protein kinase JAK2 [831-1132]
Ligand
BDBM488689
Substrate
Meas. Tech.
Enzyme Inhibition Assay
IC50
725±n/a nM
Citation
 Nilsson, KMAstrand, ABBerggren, AIJohansson, JRLepisto, MJKawatkar, SPSu, QKettle, JG JAK1 selective inhibitors US Patent  US10961228 Publication Date 3/30/2021 
Target
Name:
Tyrosine-protein kinase JAK2 [831-1132]
Synonyms:
JAK2 JAK2_HUMAN | Tyrosine-protein kinase JAK2 (aa 831-1132)
Type:
Enzyme Catalytic Domain
Mol. Mass.:
35337.99
Organism:
Homo sapiens (Human)
Description:
O60674[831-1132]
Residue:
302
  
Inhibitor
Name:
BDBM488689
Synonyms:
(R)-N-(3-(2-((2-fluoro- 3- (methylsulfonyl)phenyl) amino)-5- methylpyrimidin-4-yl)- 1H-indol-7-yl)-3- methoxy-2-(4- methylpiperazin-1- yl)propanamide | US10961228, Example 16
Type:
Small organic molecule
Emp. Form.:
C29H34FN7O4S
Mol. Mass.:
595.688
SMILES:
COC[C@@H](N1CCN(C)CC1)C(=O)Nc1cccc2c(c[nH]c12)-c1nc(Nc2cccc(c2F)S(C)(=O)=O)ncc1C
: