Target
Ectonucleotide pyrophosphatase/phosphodiesterase family member 2
Ligand
BDBM489297
Substrate
Meas. Tech.
Inhibitory Activity Assay
IC50
2.80±n/a nM
Citation
 Lee, DYChae, SEJung, EMYang, EHChoi, YJChung, CShin, JHKim, YKKwon, HJRyu, JHBan, EHKim, YZOh, YSChae, J Compounds as autotaxin inhibitors and pharmaceutical compositions comprising the same US Patent  US10961242 Publication Date 3/30/2021 
Target
Name:
Ectonucleotide pyrophosphatase/phosphodiesterase family member 2
Synonyms:
ATX Autotaxin (ATX) ENPP2 Ectonucleotide Pyrophosphatase/Phosphodiesterase 2 (ENPP2) Extracellular lysophospholipase D PDNP2
Type:
Enzyme
Mol. Mass.:
99007.13
Organism:
Homo sapiens (Human)
Description:
Q13822
Residue:
863
  
Inhibitor
Name:
BDBM489297
Synonyms:
Example 1-10 | US10961242, Compound 10
Type:
Small organic molecule
Emp. Form.:
C24H19F3N6O6
Mol. Mass.:
544.4395
SMILES:
FC(F)(F)Oc1cccc(CNc2ncc(cn2)C(=O)NC[C@H]2CN(C(=O)O2)c2ccc3[nH]c(=O)oc3c2)c1
: