Target
Ectonucleotide pyrophosphatase/phosphodiesterase family member 2
Ligand
BDBM489311
Substrate
Meas. Tech.
Inhibitory Activity Assay
IC50
3.10±n/a nM
Citation
 Lee, DYChae, SEJung, EMYang, EHChoi, YJChung, CShin, JHKim, YKKwon, HJRyu, JHBan, EHKim, YZOh, YSChae, J Compounds as autotaxin inhibitors and pharmaceutical compositions comprising the same US Patent  US10961242 Publication Date 3/30/2021 
Target
Name:
Ectonucleotide pyrophosphatase/phosphodiesterase family member 2
Synonyms:
ATX Autotaxin (ATX) ENPP2 Ectonucleotide Pyrophosphatase/Phosphodiesterase 2 (ENPP2) Extracellular lysophospholipase D PDNP2
Type:
Enzyme
Mol. Mass.:
99007.13
Organism:
Homo sapiens (Human)
Description:
Q13822
Residue:
863
  
Inhibitor
Name:
BDBM489311
Synonyms:
Example 5-3 US11548883, Compound 28
Type:
Small organic molecule
Emp. Form.:
C26H26N6O3
Mol. Mass.:
470.523
SMILES:
O=C(CN1CCN(CC1)c1cnc(NC2Cc3ccccc3C2)nc1)c1ccc2[nH]c(=O)oc2c1
: