Target
Ectonucleotide pyrophosphatase/phosphodiesterase family member 2
Ligand
BDBM489342
Substrate
Meas. Tech.
Inhibitory Activity Assay
IC50
1.80±n/a nM
Citation
 Lee, DYChae, SEJung, EMYang, EHChoi, YJChung, CShin, JHKim, YKKwon, HJRyu, JHBan, EHKim, YZOh, YSChae, J Compounds as autotaxin inhibitors and pharmaceutical compositions comprising the same US Patent  US10961242 Publication Date 3/30/2021 
Target
Name:
Ectonucleotide pyrophosphatase/phosphodiesterase family member 2
Synonyms:
ATX Autotaxin (ATX) ENPP2 Ectonucleotide Pyrophosphatase/Phosphodiesterase 2 (ENPP2) Extracellular lysophospholipase D PDNP2
Type:
Enzyme
Mol. Mass.:
99007.13
Organism:
Homo sapiens (Human)
Description:
Q13822
Residue:
863
  
Inhibitor
Name:
BDBM489342
Synonyms:
Example 9 | US10961242, Compound 60
Type:
Small organic molecule
Emp. Form.:
C23H23N9O
Mol. Mass.:
441.4884
SMILES:
O=C(Cn1cnc(c1)-c1cnc(NC2Cc3ccccc3C2)nc1)N1CCc2[nH]nnc2C1
: