Target
Ectonucleotide pyrophosphatase/phosphodiesterase family member 2
Ligand
BDBM489348
Substrate
Meas. Tech.
Inhibitory Activity Assay
IC50
1.90±n/a nM
Citation
 Lee, DYChae, SEJung, EMYang, EHChoi, YJChung, CShin, JHKim, YKKwon, HJRyu, JHBan, EHKim, YZOh, YSChae, J Compounds as autotaxin inhibitors and pharmaceutical compositions comprising the same US Patent  US10961242 Publication Date 3/30/2021 
Target
Name:
Ectonucleotide pyrophosphatase/phosphodiesterase family member 2
Synonyms:
ATX Autotaxin (ATX) ENPP2 Ectonucleotide Pyrophosphatase/Phosphodiesterase 2 (ENPP2) Extracellular lysophospholipase D PDNP2
Type:
Enzyme
Mol. Mass.:
99007.13
Organism:
Homo sapiens (Human)
Description:
Q13822
Residue:
863
  
Inhibitor
Name:
BDBM489348
Synonyms:
Example 10-6 US11548883, Compound 66
Type:
Small organic molecule
Emp. Form.:
C29H34N10O3
Mol. Mass.:
570.6455
SMILES:
O=C(Cn1cc(c(OCCN2CCOCC2)n1)-c1cnc(NC2Cc3ccccc3C2)nc1)N1CCc2[nH]nnc2C1
: