Target
Ectonucleotide pyrophosphatase/phosphodiesterase family member 2
Ligand
BDBM489351
Substrate
Meas. Tech.
Inhibitory Activity Assay
IC50
1.80±n/a nM
Citation
 Lee, DYChae, SEJung, EMYang, EHChoi, YJChung, CShin, JHKim, YKKwon, HJRyu, JHBan, EHKim, YZOh, YSChae, J Compounds as autotaxin inhibitors and pharmaceutical compositions comprising the same US Patent  US10961242 Publication Date 3/30/2021 
Target
Name:
Ectonucleotide pyrophosphatase/phosphodiesterase family member 2
Synonyms:
ATX Autotaxin (ATX) ENPP2 Ectonucleotide Pyrophosphatase/Phosphodiesterase 2 (ENPP2) Extracellular lysophospholipase D PDNP2
Type:
Enzyme
Mol. Mass.:
99007.13
Organism:
Homo sapiens (Human)
Description:
Q13822
Residue:
863
  
Inhibitor
Name:
BDBM489351
Synonyms:
Example 10-8 US11548883, Compound 68
Type:
Small organic molecule
Emp. Form.:
C28H32N10O2
Mol. Mass.:
540.6195
SMILES:
CCN1CC(C1)Oc1nn(CC(=O)N2CCc3[nH]nnc3C2)cc1-c1cnc(NC2Cc3ccccc3C2)nc1
: