Target
Tyrosine-protein kinase JAK3
Ligand
BDBM489940
Substrate
Meas. Tech.
Caliper Enzyme Assay
IC50
3.88±n/a nM
Citation
 Vazquez, MLKaila, NTuttle, JBVerhoest, PRReese, MRCoffman, KJSamad, TDuerr, JMSciabola, SParikh, MD Pyrrolo[2,3-d]pyrimidine derivatives US Patent  US10966980 Publication Date 4/6/2021 
Target
Name:
Tyrosine-protein kinase JAK3
Synonyms:
JAK-3 JAK3_HUMAN Janus kinase 3 (JAK3) L-JAK | Leukocyte janus kinase
Type:
Protein
Mol. Mass.:
125111.08
Organism:
Homo sapiens (Human)
Description:
P52333
Residue:
1124
  
Inhibitor
Name:
BDBM489940
Synonyms:
US10966980, Example 194
Type:
Small organic molecule
Emp. Form.:
C18H19FN4O2S
Mol. Mass.:
374.432
SMILES:
CN([C@@H]1C[C@H](CS(=O)(=O)c2cccc(F)c2)C1)c1ncnc2[nH]ccc12
: