Target
Leucyl-cystinyl aminopeptidase
Ligand
BDBM271290
Substrate
Meas. Tech.
Inhibition Activity Assay
IC50
0.620±n/a nM
Citation
 Kawaguchi, KIshihata, AInagaki, YTsuchiya, KHanadate, TKanai, AKaizawa, HKazami, JMorikawa, HHiramoto, MEnjo, KTakamatsu, H Pyridine derivative US Patent  US10975091 Publication Date 4/13/2021 
Target
Name:
Leucyl-cystinyl aminopeptidase
Synonyms:
Cystinyl aminopeptidase Insulin-regulated membrane aminopeptidase Irap Leucyl-cystinyl aminopeptidase Otase P-LAP Vesicle protein of 165 kDa | Vp165
Type:
PROTEIN
Mol. Mass.:
117179.39
Organism:
Rattus norvegicus
Description:
ChEMBL_98523
Residue:
1025
  
Inhibitor
Name:
BDBM271290
Synonyms:
US10059720, Example 105 | US10975091, Example 105
Type:
Small organic molecule
Emp. Form.:
C19H30N2O4S
Mol. Mass.:
382.518
SMILES:
CCSC[C@H](N)[C@](O)(Cc1cc(O[C@H]2CC[C@H](C)CC2)ccn1)C(O)=O
: