Target
Glutaminase kidney isoform, mitochondrial [63-669]
Ligand
BDBM416639
Substrate
Meas. Tech.
GLS Enzyme Potency Assay
IC50
72.6±n/a nM
Citation
 Nissink, JWFinlay, MRCharles, MD 1,3,4-thiadiazole compounds and their use in treating cancer US Patent  US10981904 Publication Date 4/20/2021 
Target
Name:
Glutaminase kidney isoform, mitochondrial [63-669]
Synonyms:
GLS GLSK_HUMAN K-glutaminase L-glutamine amidohydrolase
Type:
Mol. Mass.:
66963.68
Organism:
Homo sapiens (Human)
Description:
O94925 aa 63-669
Residue:
607
  
Inhibitor
Name:
BDBM416639
Synonyms:
(2R)-2-[3-(3-Fluoroazetidin-1-yl)phenyl]-2-methoxy-N-[5-[[(3R)-1-pyridazin-3-ylpyrrolidin-3-yl]amino]-1,3,4-thiadiazol-2-yl]acetamide and (2R)-2-[3-(3-Fluoroazetidin-1-yl)phenyl]-2-methoxy-N-[5-[[(3R)-1-pyridazin-3-ylpyrrolidin-3-yl]amino]-1,3,4-thiadiazol-2-yl]acetamide US10981904, Example 1(b)
Type:
Small organic molecule
Emp. Form.:
C22H25FN8O2S
Mol. Mass.:
484.55
SMILES:
CO[C@@H](C(=O)Nc1nnc(N[C@@H]2CCN(C2)c2cccnn2)s1)c1cccc(c1)N1CC(F)C1
: