Target
Glutaminase kidney isoform, mitochondrial [63-669]
Ligand
BDBM416652
Substrate
Meas. Tech.
GLS Enzyme Potency Assay
IC50
28.8±n/a nM
Citation
 Nissink, JWFinlay, MRCharles, MD 1,3,4-thiadiazole compounds and their use in treating cancer US Patent  US10981904 Publication Date 4/20/2021 
Target
Name:
Glutaminase kidney isoform, mitochondrial [63-669]
Synonyms:
GLS GLSK_HUMAN K-glutaminase L-glutamine amidohydrolase
Type:
Mol. Mass.:
66963.68
Organism:
Homo sapiens (Human)
Description:
O94925 aa 63-669
Residue:
607
  
Inhibitor
Name:
BDBM416652
Synonyms:
(2R)-3-Methoxy-2-(3-methoxyphenyl)-N-[5-[[(3R)-1-pyridazin-3-ylpyrrolidin-3-yl]amino]-1,3,4-thiadiazol-2-yl]propanamide and (2S)-3-Methoxy-2-(3-methoxyphenyl)-N-[5-[[(3R)-1-pyridazin-3-ylpyrrolidin-3-yl]amino]-1,3,4-thiadiazol-2-yl]propanamide US10981904, Example 5(a)
Type:
Small organic molecule
Emp. Form.:
C21H25N7O3S
Mol. Mass.:
455.533
SMILES:
COC[C@H](C(=O)Nc1nnc(N[C@@H]2CCN(C2)c2cccnn2)s1)c1cccc(OC)c1
: