Target
Serine protease 1
Ligand
BDBM429304
Substrate
IC50
99000±n/a nM
Citation
 Achdout, HAimon, ABar-David, EBarr, HBen-Shmuel, ABennett, JBoby, MLBorden, BBowman, GRBrun, JBVNBS, SCalmiano, MCarbery, ACattermole, EChernyshenko, EChodera, JDClyde, ACoffland, JECohen, GCole, JContini, ACox, LCvitkovic, MDias, ADonckers, KDotson, DLDouangamath, ADuberstein, SDudgeon, TDunnett, LEastman, PKErez, NEyermann, CJFairhead, MFate, GFearon, DFedorov, OFerla, MFernandes, RSFerrins, LFoster, RFoster, HGabizon, RGarcia-Sastre, AGawriljuk, VOGehrtz, PGileadi, CGiroud, CGlass, WGGlen, RGlinert, IGodoy, ASGorichko, MGorrie-Stone, TGriffen, EJHart, SHHeer, JHenry, MHill, MHorrell, SHurley, MFIsraely, TJajack, AJnoff, EJochmans, DJohn, TJonghe, SDKantsadi, ALKenny, PWKiappes, JLKoekemoer, LKovar, BKrojer, TLee, AALefker, BALevy, HLondon, NLukacik, PMacdonald, HBMacLean, BMalla, TRMatviiuk, TMcCorkindale, WMcGovern, BLMelamed, SMichurin, OMikolajek, HMilne, BFMorris, AMorris, GMMorwitzer, MJMoustakas, DNakamura, AMNeto, JBNeyts, JNguyen, LNoske, GDOleinikovas, VOliva, GOverheul, GJOwen, DPsenak, VPai, RPan, JParan, NPerry, BPingle, MPinjari, JPoliti, BPowell, APuni, RRangel, VLReddi, RNReid, SPResnick, ERipka, EGRobinson, MCRobinson, RPRodriguez-Guerra, JRosales, RRufa, DSchofield, CShafeev, MShaikh, AShi, JShurrush, KSingh, SSittner, ASkyner, RSmalley, ASmilova, MDSolmesky, LJSpencer, JStrain-Damerell, CSwamy, VTamir, HTennant, RThompson, WThompson, AThompson, WTomasio, STumber, AVakonakis, Ivan Rij, RPVangeel, LVarghese, FSVaschetto, MVitner, EBVoelz, VVolkamer, Avon Delft, Fvon Delft, AWalsh, MWard, WWeatherall, CWeiss, SWhite, KMWild, CFWittmann, MWright, NYahalom-Ronen, YZaidmann, DZidane, HZitzmann, N Open Science Discovery of Oral Non-Covalent SARS-CoV-2 Main Protease Inhibitor Therapeutics bioRxiv 2021:0 (2021)   
Target
Name:
Serine protease 1
Synonyms:
Alpha-trypsin chain 1 Beta-trypsin PRSS1 TRP1 TRY1_HUMAN Thrombin & trypsin Trypsin I | Trypsin-1
Type:
Enzyme
Mol. Mass.:
26557.80
Organism:
Homo sapiens (Human)
Description:
P07477
Residue:
247
  
Inhibitor
Name:
BDBM429304
Synonyms:
CVD-0006354 indole chloropyridinyl-ester derived, 1 | jm5b01461, Compound 124
Type:
Small Organic Molecule
Emp. Form.:
C14H9ClN2O2
Mol. Mass.:
272.686
SMILES:
Clc1cncc(OC(=O)c2cccc3[nH]ccc23)c1
: