Target
Nuclear receptor ROR-gamma
Ligand
BDBM504222
Substrate
Meas. Tech.
Transcreener-Fluorecescence Polarization Assay
Ki
2.50±n/a nM
Citation
 Bryan, MCDo, SDrobnick, JGobbi, AKatsumoto, TKiefer, Jr., JRLiang, JRajapaksa, NSChen, YFu, LLai, KWLiu, ZWai, JWang, F Pyrazolo[ 1,5a]pyrimidine derivatives as IRAK4 modulators US Patent  US11034698 Publication Date 6/15/2021 
Target
Name:
Nuclear receptor ROR-gamma
Synonyms:
NR1F3 Nuclear receptor ROR-gamma (RORC) RAR-related orphan receptor C (RORc) RORG RZRG Retinoid-related orphan receptor-gamma (RORc)
Type:
Enzyme Catalytic Domain
Mol. Mass.:
58218.40
Organism:
Homo sapiens (Human)
Description:
P51449
Residue:
518
  
Inhibitor
Name:
BDBM504222
Synonyms:
US11034698, Example 68 | US11034698, Example 69
Type:
Small organic molecule
Emp. Form.:
C22H23N5O4
Mol. Mass.:
421.4491
SMILES:
CC(C)Oc1cc2C(=O)N(Cc2cc1NC(=O)c1cnn2cccnc12)[C@H]1CCOC1
: