BDBM128168 6-methyl-1-[3-(trifluoromethyl)benzyl]-4-[2-(trifluoromethyl)phenyl]-2-[(3,4,5-trimethoxybenzyl)amino]-4H-pyrimidine-5-carboxylic acid methyl ester::6-methyl-4-[2-(trifluoromethyl)phenyl]-1-[[3-(trifluoromethyl)phenyl]methyl]-2-[(3,4,5-trimethoxyphenyl)methylamino]-4H-pyrimidine-5-carboxylic acid methyl ester::MLS003843157::SMR002515870::cid_53316260::methyl 6-methyl-4-[2-(trifluoromethyl)phenyl]-1-[[3-(trifluoromethyl)phenyl]methyl]-2-[(3,4,5-trimethoxyphenyl)methylamino]-4H-pyrimidine-5-carboxylate
SMILES COC(=O)C1=C(C)N(Cc2cccc(c2)C(F)(F)F)C(NCc2cc(OC)c(OC)c(OC)c2)=NC1c1ccccc1C(F)(F)F
InChI Key InChIKey=NQFPBDXHJVEPEB-UHFFFAOYSA-N
Data  1 IC50
  Tab Delimited (TSV)   2D SDfile   Computed 3D by Vconf -m prep SDfile
Find this compound or compounds like it in BindingDB:
Activity Spreadsheet -- Enzyme Inhibition Constant Data from BindingDB
Found 1 hit for monomerid = 128168
TargetRNA-editing ligase 1, mitochondrial(Trypanosoma brucei brucei)
The Scripps Research Institute Molecular Screening Center
Curated by PubChem BioAssay
LigandPNGBDBM128168(6-methyl-1-[3-(trifluoromethyl)benzyl]-4-[2-(trifl...)
Affinity DataIC50: >9.66E+4nM. Assay description: Source (MLPCN Center Name): The Scripps Research Institute Molecular Screening Center (SRIMSC) Center Affiliation: The Scripps Research Institute Ass...
In DepthDetails PCBioAssay