BDBM148378 US9682961, 27
SMILES C[C@H](O)c1nc2ccc(Nc3ncc4cccc(O[C@@H]5CC[C@H](O)CC5)c4n3)cc2[nH]1
InChI Key
Data  1 IC50
  Tab Delimited (TSV)   2D SDfile   Computed 3D by Vconf -m prep SDfile
Find this compound or compounds like it in BindingDB:
Activity Spreadsheet -- Enzyme Inhibition Constant Data from BindingDB
Found 1 hit for monomerid = 148378
TargetCatenin beta-1/Protein Wnt-3a(Homo sapiens (Human))
Carna Biosciences
US Patent
LigandPNGBDBM148378(US9682961, 27)
Affinity DataIC50:  650nM. Assay description: Using ONE-Glo Luciferase Assay System (Promega Corporation, No. E6110), the luciferase activity of the cells in the wells was measured by a microplat...
Ligand InfoPC cidPC sid
In DepthDetails US Patent