BDBM24632 5-chloro-7-(propan-2-ylamino)pyrazolo[1,5-a]pyrimidine-3-carbonitrile::pyrazolo[1,5-a]pyrimidine-3-carbonitrile, 11
SMILES CC(C)Nc1cc(Cl)nc2c(cnn12)C#N
InChI Key InChIKey=HFTLYNKTSANXFA-UHFFFAOYSA-N
Data  1 IC50
PDB links: 1 PDB ID matches this monomer.
  Tab Delimited (TSV)   2D SDfile   Computed 3D by Vconf -m prep SDfile
Find this compound or compounds like it in BindingDB:
Activity Spreadsheet -- Enzyme Inhibition Constant Data from BindingDB
Found 1 hit for monomerid = 24632
TargetCyclin-A2/Cyclin-dependent kinase 2(Homo sapiens (Human))
Astex
LigandPNGBDBM24632(5-chloro-7-(propan-2-ylamino)pyrazolo[1,5-a]pyrimi...)
Affinity DataIC50:  1.50E+3nMpH: 7.2 T: 2°C. Assay description: CDK2/cyclin A activity was determined using a radiometric assay to measure the incorporation of gamma-phosphate from [gamma-33P]-ATP into histone H1....