BDBM32684 2,5-diethoxy-N,N-bis(phenylmethyl)-4-(1,2,3,4-tetrazol-1-yl)benzenesulfonamide::2,5-diethoxy-N,N-bis(phenylmethyl)-4-(1-tetrazolyl)benzenesulfonamide::MLS000123189::N,N-Dibenzyl-2,5-diethoxy-4-tetrazol-1-yl-benzenesulfonamide::N,N-dibenzyl-2,5-diethoxy-4-(tetrazol-1-yl)benzenesulfonamide::SMR000123807::cid_1428872
SMILES CCOc1cc(c(OCC)cc1-n1cnnn1)S(=O)(=O)N(Cc1ccccc1)Cc1ccccc1
InChI Key InChIKey=UTOWJQUGCQYGKS-UHFFFAOYSA-N
Data  2 IC50
  Tab Delimited (TSV)   2D SDfile   Computed 3D by Vconf -m prep SDfile
Find this compound or compounds like it in BindingDB:
Activity Spreadsheet -- Enzyme Inhibition Constant Data from BindingDB
Found 2 hits for monomerid = 32684
TargetCoagulation factor XI(Homo sapiens (Human))
Pcmd
Curated by PubChem BioAssay
LigandPNGBDBM32684(2,5-diethoxy-N,N-bis(phenylmethyl)-4-(1,2,3,4-tetr...)
Affinity DataIC50: >5.00E+4nM. Assay description: Molecular Library Screening Center Network (MLSCN) Penn Center for Molecular Discovery (PCMD) Assay Provider: Scott L. Diamond, University of Pennsy...
In DepthDetails PCBioAssay
TargetCoagulation factor XI(Homo sapiens (Human))
Pcmd
Curated by PubChem BioAssay
LigandPNGBDBM32684(2,5-diethoxy-N,N-bis(phenylmethyl)-4-(1,2,3,4-tetr...)
Affinity DataIC50: >5.00E+4nMpH: 7.4 T: 2°C. Assay description: Factor XIa (0.23 ug/mL) was incubated with Boc-Glu-Ala-Arg-AMC substrate (15 uM) in 10 uL of assay buffer for 2 hr at room temperature. Read fluoresc...
In DepthDetails PCBioAssay