BDBM32711 2-methyl-5-oxo-4-(4-oxo-1-benzopyran-3-yl)-4,6,7,8-tetrahydro-1H-quinoline-3-carboxylic acid propan-2-yl ester::5-keto-4-(4-ketochromen-3-yl)-2-methyl-4,6,7,8-tetrahydro-1H-quinoline-3-carboxylic acid isopropyl ester::MLS000533594::SMR000141032::cid_2874334::isopropyl 2-methyl-5-oxo-4-(4-oxo-4H-chromen-3-yl)-1,4,5,6,7,8-hexahydro-3-quinolinecarboxylate::propan-2-yl 2-methyl-5-oxidanylidene-4-(4-oxidanylidenechromen-3-yl)-4,6,7,8-tetrahydro-1H-quinoline-3-carboxylate::propan-2-yl 2-methyl-5-oxo-4-(4-oxochromen-3-yl)-4,6,7,8-tetrahydro-1H-quinoline-3-carboxylate
SMILES CC(C)OC(=O)C1=C(C)N=C2CCCC(=O)C2C1c1coc2ccccc2c1=O
InChI Key InChIKey=PNGYTEFQMVIKNZ-UHFFFAOYSA-N
Data  2 IC50
  Tab Delimited (TSV)   2D SDfile   Computed 3D by Vconf -m prep SDfile
Find this compound or compounds like it in BindingDB:
Activity Spreadsheet -- Enzyme Inhibition Constant Data from BindingDB
Found 2 hits for monomerid = 32711
TargetCoagulation factor XI(Homo sapiens (Human))
Pcmd
Curated by PubChem BioAssay
LigandPNGBDBM32711(2-methyl-5-oxo-4-(4-oxo-1-benzopyran-3-yl)-4,6,7,8...)
Affinity DataIC50: >5.00E+4nM. Assay description: Molecular Library Screening Center Network (MLSCN) Penn Center for Molecular Discovery (PCMD) Assay Provider: Scott L. Diamond, University of Pennsy...
In DepthDetails PCBioAssay
TargetCoagulation factor XI(Homo sapiens (Human))
Pcmd
Curated by PubChem BioAssay
LigandPNGBDBM32711(2-methyl-5-oxo-4-(4-oxo-1-benzopyran-3-yl)-4,6,7,8...)
Affinity DataIC50: >5.00E+4nMpH: 7.4 T: 2°C. Assay description: Factor XIa (0.23 ug/mL) was incubated with Boc-Glu-Ala-Arg-AMC substrate (15 uM) in 10 uL of assay buffer for 2 hr at room temperature. Read fluoresc...
In DepthDetails PCBioAssay