BDBM35503 4-ethoxy-6-(1-piperidinyl)-1,3,5-triazine-2-carbonitrile::4-ethoxy-6-piperidin-1-yl-1,3,5-triazine-2-carbonitrile::4-ethoxy-6-piperidino-s-triazine-2-carbonitrile::MLS000043919::SMR000021130::cid_729558
SMILES CCOc1nc(nc(n1)N1CCCCC1)C#N
InChI Key InChIKey=NDVFBWWXDABNKV-UHFFFAOYSA-N
Data  6 IC50
  Tab Delimited (TSV)   2D SDfile   Computed 3D by Vconf -m prep SDfile
Find this compound or compounds like it in BindingDB:
Activity Spreadsheet -- Enzyme Inhibition Constant Data from BindingDB
Found 6 hits for monomerid = 35503
TargetCathepsin B(Homo sapiens (Human))
Pcmd
Curated by PubChem BioAssay
LigandPNGBDBM35503(4-ethoxy-6-(1-piperidinyl)-1,3,5-triazine-2-carbon...)
Affinity DataIC50: >5.00E+4nMpH: 6.8 T: 2°C. Assay description: Screening Center: Penn Center for Molecular Discovery Center Affiliation: University of Pennsylvania Network: Molecular Library Screening Center Netw...
In DepthDetails PCBioAssay
TargetProcathepsin L(Homo sapiens (Human))
Pcmd
Curated by PubChem BioAssay
LigandPNGBDBM35503(4-ethoxy-6-(1-piperidinyl)-1,3,5-triazine-2-carbon...)
Affinity DataIC50:  1.58E+3nM. Assay description: Screening Center: Penn Center for Molecular Discovery Center Affiliation: University of Pennsylvania Network: Molecular Library Screening Center Netw...
In DepthDetails PCBioAssay
TargetCruzipain(Trypanosoma cruzi)
National Human Genome Research Institute
Curated by ChEMBL
LigandPNGBDBM35503(4-ethoxy-6-(1-piperidinyl)-1,3,5-triazine-2-carbon...)
Affinity DataIC50:  90nM. Assay description: Inhibition of recombinant Trypanosoma cruzi cruzain after 5 mins by spectrofluorimetric analysis
In DepthDetails ArticlePubMed
TargetProcathepsin L(Homo sapiens (Human))
Pcmd
Curated by PubChem BioAssay
LigandPNGBDBM35503(4-ethoxy-6-(1-piperidinyl)-1,3,5-triazine-2-carbon...)
Affinity DataIC50:  1.11E+3nM. Assay description: Screening Center: Penn Center for Molecular Discovery Center Affiliation: University of Pennsylvania Network: Molecular Library Screening Center Netw...
In DepthDetails PCBioAssay
TargetGalanin receptor type 3(Homo sapiens (Human))
The Scripps Research Institute Molecular Screening Center
Curated by PubChem BioAssay
LigandPNGBDBM35503(4-ethoxy-6-(1-piperidinyl)-1,3,5-triazine-2-carbon...)
Affinity DataIC50:  1.09E+3nM
In DepthDetails PCBioAssay
TargetCathepsin S(Homo sapiens (Human))
Pcmd
Curated by PubChem BioAssay
LigandPNGBDBM35503(4-ethoxy-6-(1-piperidinyl)-1,3,5-triazine-2-carbon...)
Affinity DataIC50:  1.34E+4nM. Assay description: Screening Center: Penn Center for Molecular Discovery Center Affiliation: University of Pennsylvania Network: Molecular Library Screening Center Netw...
In DepthDetails PCBioAssay