BDBM37971 7-Oxo-7H-thiazolo[3,2-a]pyrimidine-5-carboxylic acid methyl ester::7-ketothiazolo[3,2-a]pyrimidine-5-carboxylic acid methyl ester::7-oxo-5-thiazolo[3,2-a]pyrimidinecarboxylic acid methyl ester::MLS000075913::SMR000013440::cid_648108::methyl 7-oxidanylidene-[1,3]thiazolo[3,2-a]pyrimidine-5-carboxylate::methyl 7-oxo-[1,3]thiazolo[3,2-a]pyrimidine-5-carboxylate
SMILES COC(=O)c1cc(=O)nc2sccn12
InChI Key InChIKey=YPIZITNNUSTRMY-UHFFFAOYSA-N
Data  2 IC50
  Tab Delimited (TSV)   2D SDfile   Computed 3D by Vconf -m prep SDfile
Find this compound or compounds like it in BindingDB:
Activity Spreadsheet -- Enzyme Inhibition Constant Data from BindingDB
Found 2 hits for monomerid = 37971
TargetHeat shock protein hsp-16.2(Caenorhabditis elegans)
Burnham Center For Chemical Genomics
Curated by PubChem BioAssay
LigandPNGBDBM37971(7-Oxo-7H-thiazolo[3,2-a]pyrimidine-5-carboxylic ac...)
Affinity DataIC50:  4.36E+4nM
In DepthDetails PCBioAssay
TargetProtein skinhead-1(Caenorhabditis elegans)
Burnham Center For Chemical Genomics
Curated by PubChem BioAssay
LigandPNGBDBM37971(7-Oxo-7H-thiazolo[3,2-a]pyrimidine-5-carboxylic ac...)
Affinity DataIC50:  2.19E+4nM
In DepthDetails PCBioAssay