BDBM39433 3-amino-5-methyl-1H-indole-2-carboxylic acid ethyl ester::MLS000079379::SMR000036321::cid_657472::ethyl 3-amino-5-methyl-1H-indole-2-carboxylate::ethyl 3-azanyl-5-methyl-1H-indole-2-carboxylate
SMILES CCOC(=O)c1[nH]c2ccc(C)cc2c1N
InChI Key InChIKey=SMKHWBBDIZIBLD-UHFFFAOYSA-N
Data  3 EC50
  Tab Delimited (TSV)   2D SDfile   Computed 3D by Vconf -m prep SDfile
Find this compound or compounds like it in BindingDB:
Activity Spreadsheet -- Enzyme Inhibition Constant Data from BindingDB
Found 3 hits for monomerid = 39433
TargetSteroidogenic factor 1(Homo sapiens (Human))
The Scripps Research Institute Molecular Screening Center
Curated by PubChem BioAssay
LigandPNGBDBM39433(3-amino-5-methyl-1H-indole-2-carboxylic acid ethyl...)
Affinity DataEC50:  544nM. Assay description: Source (MLSCN Center Name): The Scripps Research Institute Molecular Screening Center Center Affiliation: The Scripps Research Institute, TSRI Assay ...
In DepthDetails PCBioAssay
TargetATP-dependent molecular chaperone HSP82(Candida albicans)
Broad Institute
Curated by PubChem BioAssay
LigandPNGBDBM39433(3-amino-5-methyl-1H-indole-2-carboxylic acid ethyl...)
Affinity DataEC50:  2.59E+3nM. Assay description: Broad Institute: Reversing Antifungal Drug Resistance Project ID: 2037 Keywords: Candida albicans, drug resistance, Fluconazole, Hsp90, Calcineurin, ...
In DepthDetails PCBioAssay
TargetIsoform 2 of Nuclear receptor ROR-alpha (Alpha-2)(Homo sapiens (Human))
The Scripps Research Institute Molecular Screening Center
Curated by PubChem BioAssay
LigandPNGBDBM39433(3-amino-5-methyl-1H-indole-2-carboxylic acid ethyl...)
Affinity DataEC50:  731nM. Assay description: Source (MLSCN Center Name): The Scripps Research Institute Molecular Screening Center Center Affiliation: The Scripps Research Institute, TSRI Assay ...
In DepthDetails PCBioAssay