BDBM40270 2,2,4,6,7-Pentamethyl-1,2-dihydro-quinoline::2,2,4,6,7-pentamethyl-1H-quinoline::MLS000029744::SMR000009038::cid_647805
SMILES CC1=CC(C)(C)Nc2cc(C)c(C)cc12
InChI Key InChIKey=RBJGTNCZCXCGPZ-UHFFFAOYSA-N
Data  1 IC50
  Tab Delimited (TSV)   2D SDfile   Computed 3D by Vconf -m prep SDfile
Find this compound or compounds like it in BindingDB:
Activity Spreadsheet -- Enzyme Inhibition Constant Data from BindingDB
Found 1 hit for monomerid = 40270
TargetUbiquitin carboxyl-terminal hydrolase BAP1(Homo sapiens (Human))
Emory University
Curated by PubChem BioAssay
LigandPNGBDBM40270(2,2,4,6,7-Pentamethyl-1,2-dihydro-quinoline | 2,2,...)
Affinity DataIC50: >5.00E+4nM. Assay description: NIH Molecular Libraries Screening Centers Network [MLSCN] Emory Chemical Biology Discovery Center in MLSCN Assay provider: Keith D. Wilkinson, Emory ...
In DepthDetails PCBioAssay