BDBM40276 5-Acetyl-4-methyl-2-[2-(5-phenyl-tetrazol-2-yl)-acetylamino]-thiophene-3-carboxylic acid ethyl ester::5-acetyl-4-methyl-2-[[1-oxo-2-(5-phenyl-2-tetrazolyl)ethyl]amino]-3-thiophenecarboxylic acid ethyl ester::5-acetyl-4-methyl-2-[[2-(5-phenyltetrazol-2-yl)acetyl]amino]thiophene-3-carboxylic acid ethyl ester::MLS000071676::SMR000001564::cid_651347::ethyl 5-acetyl-4-methyl-2-[[2-(5-phenyltetrazol-2-yl)acetyl]amino]thiophene-3-carboxylate::ethyl 5-ethanoyl-4-methyl-2-[2-(5-phenyl-1,2,3,4-tetrazol-2-yl)ethanoylamino]thiophene-3-carboxylate
SMILES CCOC(=O)c1c(C)c(sc1NC(=O)Cn1nnc(n1)-c1ccccc1)C(C)=O
InChI Key InChIKey=WJJXNBRIYRNCTB-UHFFFAOYSA-N
Data  1 IC50
  Tab Delimited (TSV)   2D SDfile   Computed 3D by Vconf -m prep SDfile
Find this compound or compounds like it in BindingDB:
Activity Spreadsheet -- Enzyme Inhibition Constant Data from BindingDB
Found 1 hit for monomerid = 40276
TargetUbiquitin carboxyl-terminal hydrolase BAP1(Homo sapiens (Human))
Emory University
Curated by PubChem BioAssay
LigandPNGBDBM40276(5-Acetyl-4-methyl-2-[2-(5-phenyl-tetrazol-2-yl)-ac...)
Affinity DataIC50:  2.31E+4nM. Assay description: NIH Molecular Libraries Screening Centers Network [MLSCN] Emory Chemical Biology Discovery Center in MLSCN Assay provider: Keith D. Wilkinson, Emory ...
In DepthDetails PCBioAssay