BDBM40300 2-[2-(3,4-dichlorophenyl)-2-oxidanylidene-ethyl]sulfanyl-5-ethanoyl-4-(furan-2-yl)-6-methyl-1,4-dihydropyridine-3-carbonitrile::5-acetyl-2-[2-(3,4-dichlorophenyl)-2-oxoethyl]sulfanyl-4-(furan-2-yl)-6-methyl-1,4-dihydropyridine-3-carbonitrile::5-acetyl-2-[[2-(3,4-dichlorophenyl)-2-keto-ethyl]thio]-4-(2-furyl)-6-methyl-1,4-dihydropyridine-3-carbonitrile::5-acetyl-2-[[2-(3,4-dichlorophenyl)-2-oxoethyl]thio]-4-(2-furanyl)-6-methyl-1,4-dihydropyridine-3-carbonitrile::MLS000107933::SMR000103897::cid_2862213
SMILES CC(=O)C1=C(C)N=C(SCC(=O)c2ccc(Cl)c(Cl)c2)C(C#N)C1c1ccco1
InChI Key InChIKey=VLGNBKDCFADHPG-UHFFFAOYSA-N
Data  1 IC50
  Tab Delimited (TSV)   2D SDfile   Computed 3D by Vconf -m prep SDfile
Find this compound or compounds like it in BindingDB:
Activity Spreadsheet -- Enzyme Inhibition Constant Data from BindingDB
Found 1 hit for monomerid = 40300
TargetUbiquitin carboxyl-terminal hydrolase BAP1(Homo sapiens (Human))
Emory University
Curated by PubChem BioAssay
LigandPNGBDBM40300(2-[2-(3,4-dichlorophenyl)-2-oxidanylidene-ethyl]su...)
Affinity DataIC50: >5.00E+4nM. Assay description: NIH Molecular Libraries Screening Centers Network [MLSCN] Emory Chemical Biology Discovery Center in MLSCN Assay provider: Keith D. Wilkinson, Emory ...
In DepthDetails PCBioAssay