BDBM412042 2-amino-6-fluoro-N-(5-fluoro-4-(4-(piperazine-1-carbonyl)piperidin-1-yl)pyridin-3-yl)pyrazolo[1,5-a]pyrimidine-3-carboxamide ::US10392391, Compound I-G-12::US10787452, Compound I-G-12::US11117900, Compound I-G-12::US11370798, Cmpd. # I-G-12::US20230271963, Compound I-G-12
SMILES Nc1nn2cc(F)cnc2c1C(=O)Nc1cncc(F)c1N1CCC(CC1)C(=O)N1CCNCC1
InChI Key InChIKey=ICYWWCROPRXAKM-UHFFFAOYSA-N
Data  10 KI
  Tab Delimited (TSV)   2D SDfile   Computed 3D by Vconf -m prep SDfile
Find this compound or compounds like it in BindingDB:
Activity Spreadsheet -- Enzyme Inhibition Constant Data from BindingDB
Found 10 hits for monomerid = 412042
TargetSerine/threonine-protein kinase ATR(Homo sapiens (Human))
Vertex Pharmaceuticals
US Patent
LigandPNGBDBM412042(2-amino-6-fluoro-N-(5-fluoro-4-(4-(piperazine-1-ca...)
Affinity DataKi: <10nM. Assay description: Compounds were screened for their ability to inhibit ATR kinase using a radioactive-phosphate incorporation assay. Assays were carried out in a mixtu...
Ligand Info
In DepthDetails US Patent
TargetSerine/threonine-protein kinase ATR(Homo sapiens (Human))
Vertex Pharmaceuticals
US Patent
LigandPNGBDBM412042(2-amino-6-fluoro-N-(5-fluoro-4-(4-(piperazine-1-ca...)
Affinity DataKi: <10nM. Assay description: Compounds were screened for their ability to inhibit ATR kinase using a radioactive-phosphate incorporation assay. Assays were carried out in a mixtu...
Ligand Info
In DepthDetails US Patent
TargetSerine/threonine-protein kinase ATR(Homo sapiens (Human))
Vertex Pharmaceuticals
US Patent
LigandPNGBDBM412042(2-amino-6-fluoro-N-(5-fluoro-4-(4-(piperazine-1-ca...)
Affinity DataKi: <10nM. Assay description: Assays were carried out at 25° C. in the presence of 5 nM full-length ATR. An assay stock buffer solution was prepared containing all of the reagents...
Ligand Info
In DepthDetails US Patent
LigandPNGBDBM412042(2-amino-6-fluoro-N-(5-fluoro-4-(4-(piperazine-1-ca...)
Affinity DataKi: <20nM. Assay description: Assays were carried out at 25° C. in the presence of 4 nM full-length ATR, 40 nM full-length ATRIP, 40 nM full-length CLK2 and 600 nM TopBP1(A891-S11...
Ligand Info
In DepthDetails US Patent
LigandPNGBDBM412042(2-amino-6-fluoro-N-(5-fluoro-4-(4-(piperazine-1-ca...)
Affinity DataKi: <200nM. Assay description: Table 7: Compounds were screened for their ability to inhibit ATR kinase, in the presence of partner proteins ATRIP, CLK2 and TopBP1, using a radioac...
Ligand Info
In DepthDetails US Patent
TargetSerine/threonine-protein kinase ATR(Homo sapiens (Human))
Vertex Pharmaceuticals
US Patent
LigandPNGBDBM412042(2-amino-6-fluoro-N-(5-fluoro-4-(4-(piperazine-1-ca...)
Affinity DataKi:  505nM. Assay description: Compounds were screened for their ability to inhibit ATR kinase using a radioactive-phosphate incorporation assay. Assays were carried out in a mixtu...
Ligand Info
In DepthDetails US Patent
TargetSerine/threonine-protein kinase ATR(Homo sapiens (Human))
Vertex Pharmaceuticals
US Patent
LigandPNGBDBM412042(2-amino-6-fluoro-N-(5-fluoro-4-(4-(piperazine-1-ca...)
Affinity DataKi:  505nM. Assay description: Compounds were screened for their ability to inhibit ATR kinase using a radioactive-phosphate incorporation assay. Assays were carried out in a mixtu...
Ligand Info
In DepthDetails US Patent
TargetSerine/threonine-protein kinase ATR(Homo sapiens (Human))
Vertex Pharmaceuticals
US Patent
LigandPNGBDBM412042(2-amino-6-fluoro-N-(5-fluoro-4-(4-(piperazine-1-ca...)
Affinity DataKi:  505nM. Assay description: Assays were carried out at 25° C. in the presence of 5 nM full-length ATR. An assay stock buffer solution was prepared containing all of the reagents...
Ligand Info
In DepthDetails US Patent
TargetSerine/threonine-protein kinase ATR(Homo sapiens (Human))
Vertex Pharmaceuticals
US Patent
LigandPNGBDBM412042(2-amino-6-fluoro-N-(5-fluoro-4-(4-(piperazine-1-ca...)
Affinity DataKi:  550nM. Assay description: Table 5: Compounds were screened for their ability to inhibit ATR kinase using a radioactive-phosphate incorporation assay. Assays were carried out i...
Ligand Info
In DepthDetails US Patent
TargetSerine/threonine-protein kinase ATR(Homo sapiens (Human))
Vertex Pharmaceuticals
US Patent
LigandPNGBDBM412042(2-amino-6-fluoro-N-(5-fluoro-4-(4-(piperazine-1-ca...)
Affinity DataKi:  3.00E+3nM. Assay description: Compounds were screened for their ability to inhibit ATR kinase using a radioactive-phosphate incorporation assay. Assays were carried out in a mixtu...
Ligand Info
In DepthDetails US Patent