BDBM41237 MLS000090455::N-[1-(cyclohexylamino)-2-methyl-1-oxidanylidene-butan-2-yl]pyridine-2-carboxamide::N-[1-(cyclohexylamino)-2-methyl-1-oxobutan-2-yl]-2-pyridinecarboxamide::N-[1-(cyclohexylamino)-2-methyl-1-oxobutan-2-yl]pyridine-2-carboxamide::N-[1-(cyclohexylcarbamoyl)-1-methyl-propyl]picolinamide::N-{1-[(cyclohexylamino)carbonyl]-1-methylpropyl}pyridine-2-carboxamide::SMR000025065::cid_3238072
SMILES CCC(C)(NC(=O)c1ccccn1)C(=O)NC1CCCCC1
InChI Key InChIKey=FGNPDLCIMWPXNM-UHFFFAOYSA-N
Data  1 IC50  1 EC50
  Tab Delimited (TSV)   2D SDfile   Computed 3D by Vconf -m prep SDfile
Find this compound or compounds like it in BindingDB:
Activity Spreadsheet -- Enzyme Inhibition Constant Data from BindingDB
Found 2 hits for monomerid = 41237
TargetHeat shock factor protein 1(Mus musculus)
Broad Institute
Curated by PubChem BioAssay
LigandPNGBDBM41237(MLS000090455 | N-[1-(cyclohexylamino)-2-methyl-1-o...)
Affinity DataEC50: >1.95E+5nM. Assay description: Keywords: Heat Shock Factor-1 (HSF-1), Stress Response, MG132, NIH3T3, Luminescence Assay Overview: Modified NIH3T3, transformed to express firefly...
In DepthDetails PCBioAssay
TargetDNA-directed RNA polymerase subunit beta(Escherichia coli)
Pcmd
Curated by PubChem BioAssay
LigandPNGBDBM41237(MLS000090455 | N-[1-(cyclohexylamino)-2-methyl-1-o...)
Affinity DataIC50: >5.00E+4nM. Assay description: Screening Center: Penn Center for Molecular Discovery Center Affiliation: University of Pennsylvania Network: Molecular Library Screening Center Netw...
In DepthDetails PCBioAssay