BDBM412666 (S)-N-((5-(ethylsulfonyl)pyridin-2-yl)methyl)-7-isopropyl-6-((trans-4-(trifluoromethyl)cyclohexyl)methyl)-6,7-dihydro-5H-pyrrolo[3,4-b]pyridine-3-carboxamide::US10399976, Compound 2::US10807980, Compound 2::US11535614, Compound 2
SMILES CCS(=O)(=O)c1ccc(CNC(=O)c2cnc3[C@H](C(C)C)N(C[C@H]4CC[C@@H](CC4)C(F)(F)F)Cc3c2)nc1
InChI Key InChIKey=XUYMIRYNRKXKOR-HMHJJOSWSA-N
Data  3 KI  2 IC50
PDB links: 1 PDB ID matches this monomer.
  Tab Delimited (TSV)   2D SDfile   Computed 3D by Vconf -m prep SDfile
Find this compound or compounds like it in BindingDB:
Activity Spreadsheet -- Enzyme Inhibition Constant Data from BindingDB
Found 5 hits for monomerid = 412666
TargetNuclear receptor ROR-gamma(Homo sapiens (Human))
Vitae Pharmaceuticals
US Patent
LigandPNGBDBM412666((S)-N-((5-(ethylsulfonyl)pyridin-2-yl)methyl)-7-is...)
Affinity DataKi: <100nM. Assay description: Compounds of the present invention were tested for ability to bind to ROR gamma in a cell-free competition assay with commercially available radio-li...
Ligand InfoPurchasePDB
TargetNuclear receptor ROR-gamma(Homo sapiens (Human))
Vitae Pharmaceuticals
US Patent
LigandPNGBDBM412666((S)-N-((5-(ethylsulfonyl)pyridin-2-yl)methyl)-7-is...)
Affinity DataKi: <100nM. Assay description: Compounds of the present invention were tested for ability to bind to RORγ in a cell-free competition assay with commercially available radio-li...
Ligand InfoPurchasePDB
TargetNuclear receptor ROR-gamma(Homo sapiens (Human))
Vitae Pharmaceuticals
US Patent
LigandPNGBDBM412666((S)-N-((5-(ethylsulfonyl)pyridin-2-yl)methyl)-7-is...)
Affinity DataKi: <100nM. Assay description: Compounds of the present invention were tested for ability to bind to RORγ in a cell-free competition assay with commercially available radio-li...
Ligand InfoPurchasePDB
TargetNuclear receptor ROR-gamma(Homo sapiens (Human))
Vitae Pharmaceuticals
US Patent
LigandPNGBDBM412666((S)-N-((5-(ethylsulfonyl)pyridin-2-yl)methyl)-7-is...)
Affinity DataIC50: <100nM. Assay description: Compounds of the present invention were tested for RORγ inverse agonist activity in a cell-based, transcriptional activity assay. Secreted Nanol...
Ligand InfoPurchasePDB
TargetNuclear receptor ROR-gamma(Homo sapiens (Human))
Vitae Pharmaceuticals
US Patent
LigandPNGBDBM412666((S)-N-((5-(ethylsulfonyl)pyridin-2-yl)methyl)-7-is...)
Affinity DataIC50: <100nM. Assay description: Compounds of the present invention were tested for ROR gamma inverse agonist activity in a cell-based, transcriptional activity assay. Secreted Nanol...
Ligand InfoPurchasePDB