BDBM47616 2-amino-3-[(4-hydroxyphenyl)diazenyl]-7-methylpyrazolo[1,5-a]pyrimidin-5(4H)-one::2-amino-3-[N'-(4-ketocyclohexa-2,5-dien-1-ylidene)hydrazino]-7-methyl-1H-pyrazolo[1,5-a]pyrimidin-5-one::2-amino-7-methyl-3-[2-(4-oxo-1-cyclohexa-2,5-dienylidene)hydrazinyl]-1H-pyrazolo[1,5-a]pyrimidin-5-one::2-amino-7-methyl-3-[2-(4-oxocyclohexa-2,5-dien-1-ylidene)hydrazinyl]-1H-pyrazolo[1,5-a]pyrimidin-5-one::2-azanyl-7-methyl-3-[2-(4-oxidanylidenecyclohexa-2,5-dien-1-ylidene)hydrazinyl]-1H-pyrazolo[1,5-a]pyrimidin-5-one::MLS000705177::SMR000230990::cid_5705988
SMILES Cc1cc(=O)[nH]c2c(N=Nc3ccc(O)cc3)c(N)nn12
InChI Key InChIKey=ULGKJVGYTSXNNV-UHFFFAOYSA-N
Data  2 IC50  1 EC50
  Tab Delimited (TSV)   2D SDfile   Computed 3D by Vconf -m prep SDfile
Find this compound or compounds like it in BindingDB:
Activity Spreadsheet -- Enzyme Inhibition Constant Data from BindingDB
Found 3 hits for monomerid = 47616
TargetGlutathione S-transferase Mu 1(Homo sapiens (Human))
Nmmlsc
Curated by PubChem BioAssay
LigandPNGBDBM47616(2-amino-3-[(4-hydroxyphenyl)diazenyl]-7-methylpyra...)
Affinity DataEC50:  1.40E+3nM. Assay description: University of New Mexico Assay Overview: Assay Support: NIH I RO3 MH081231-01 HTS to identify specific small molecule inhibitors of Ras and Ras-re...
In DepthDetails PCBioAssay
TargetProcathepsin L(Homo sapiens (Human))
The Scripps Research Institute Molecular Screening Center
Curated by PubChem BioAssay
LigandPNGBDBM47616(2-amino-3-[(4-hydroxyphenyl)diazenyl]-7-methylpyra...)
Affinity DataIC50: >5.96E+4nM. Assay description: Source (MLPCN Center Name): The Scripps Research Institute Molecular Screening Center Affiliation: The Scripps Research Institute, TSRI Assay Provide...
In DepthDetails PCBioAssay
TargetM18 aspartyl aminopeptidase(Plasmodium falciparum 3D7)
The Scripps Research Institute Molecular Screening Center
Curated by PubChem BioAssay
LigandPNGBDBM47616(2-amino-3-[(4-hydroxyphenyl)diazenyl]-7-methylpyra...)
Affinity DataIC50:  1.51E+3nM. Assay description: Source (MLPCN Center Name): The Scripps Research Institute Molecular Screening Center Affiliation: The Scripps Research Institute, TSRI Assay Provide...
In DepthDetails PCBioAssay