BDBM47986 (3Z)-3-[2-(2-furanyl)-2-oxoethylidene]-6-methyl-4H-1,4-benzoxazin-2-one::(3Z)-3-[2-(2-furyl)-2-keto-ethylidene]-6-methyl-4H-1,4-benzoxazin-2-one::(3Z)-3-[2-(furan-2-yl)-2-oxidanylidene-ethylidene]-6-methyl-4H-1,4-benzoxazin-2-one::(3Z)-3-[2-(furan-2-yl)-2-oxoethylidene]-6-methyl-4H-1,4-benzoxazin-2-one::3-[2-Furan-2-yl-2-oxo-eth-(E)-ylidene]-6-methyl-3,4-dihydro-benzo[1,4]oxazin-2-one::MLS000769636::SMR000434358::cid_6887790
SMILES Cc1ccc2oc(=O)c(CC(=O)c3ccco3)nc2c1
InChI Key InChIKey=XSFFQCDCWWNLCJ-UHFFFAOYSA-N
Data  1 IC50  2 EC50
  Tab Delimited (TSV)   2D SDfile   Computed 3D by Vconf -m prep SDfile
Find this compound or compounds like it in BindingDB:
Activity Spreadsheet -- Enzyme Inhibition Constant Data from BindingDB
Found 3 hits for monomerid = 47986
TargetHeat shock protein HSP 90-alpha(Homo sapiens (Human))
The Scripps Research Institute Molecular Screening Center
Curated by PubChem BioAssay
LigandPNGBDBM47986((3Z)-3-[2-(2-furanyl)-2-oxoethylidene]-6-methyl-4H...)
Affinity DataIC50:  5.13E+3nM. Assay description: Source (MLPCN Center Name): The Scripps Research Institute Molecular Screening Center (SRIMSC) Center Affiliation: The Scripps Research Institute (TS...
In DepthDetails PCBioAssay
TargetCorticotropin-releasing factor-binding protein(Homo sapiens (Human))
Burnham Center For Chemical Genomics
Curated by PubChem BioAssay
LigandPNGBDBM47986((3Z)-3-[2-(2-furanyl)-2-oxoethylidene]-6-methyl-4H...)
Affinity DataEC50:  4.74E+3nM. Assay description: Data Source: Sanford-Burnham Center for Chemical Genomics (SBCCG) Source Affiliation: Sanford-Burnham Medical Research Institute (SBMRI, San Diego, C...
In DepthDetails PCBioAssay
TargetProtein LANA1(Human herpesvirus 8)
Broad Institute
Curated by PubChem BioAssay
LigandPNGBDBM47986((3Z)-3-[2-(2-furanyl)-2-oxoethylidene]-6-methyl-4H...)
Affinity DataEC50: >7.50E+4nM. Assay description: Primary Collaborators: Kenneth Kaye,Brigham & Womens,Boston MA,kkaye@rics.bwh.harvard.edu,617-525-4256 Chantal Beauchemin,Brigham & Womens,Boston MA,...
In DepthDetails PCBioAssay