BDBM481132 US10906896, Cpd 880::US11725005, Compound 880
SMILES Cc1ccc(NC(=O)c2ccc(CN3CCNCC3)cc2)cc1Nc1nccc(n1)-c1cncc(c1)-c1ccccn1
InChI Key InChIKey=JSAIPLUIDULEAD-UHFFFAOYSA-N
Data  1 KI  5 IC50
  Tab Delimited (TSV)   2D SDfile   Computed 3D by Vconf -m prep SDfile
Find this compound or compounds like it in BindingDB:
Activity Spreadsheet -- Enzyme Inhibition Constant Data from BindingDB
Found 6 hits for monomerid = 481132
TargetMast/stem cell growth factor receptor Kit(Homo sapiens (Human))
Inhibikase Therapeutics
US Patent
LigandPNGBDBM481132(US10906896, Cpd 880 | US11725005, Compound 880)
Affinity DataKi:  12nM. Assay description: Kinase base buffer (50 mM HEPES, pH 7.5 0.0015% Brij-35; 10 mM MgCl2 2 mM DTT) and Stop buffer, (100 mM HEPES, pH 7.5 0.015% Brij-35; 0.2% Coating Re...
Ligand InfoPC cidPC sid
In DepthDetails US Patent
TargetTyrosine-protein kinase ABL2(Homo sapiens (Human))
Inhibikase Therapeutics
US Patent
LigandPNGBDBM481132(US10906896, Cpd 880 | US11725005, Compound 880)
Affinity DataIC50:  341nM. Assay description: Kinase base buffer (50 mM HEPES, pH 7.5 0.0015% Brij-35; 10 mM MgCl2 2 mM DTT) and Stop buffer, (100 mM HEPES, pH 7.5 0.015% Brij-35; 0.2% Coating Re...
Ligand InfoPC cidPC sid
In DepthDetails US Patent
TargetMast/stem cell growth factor receptor Kit(Homo sapiens (Human))
Inhibikase Therapeutics
US Patent
LigandPNGBDBM481132(US10906896, Cpd 880 | US11725005, Compound 880)
Affinity DataIC50:  12nM. Assay description: Kinase base buffer (50 mM HEPES, pH 7.5 0.0015% Brij-35; 10 mM MgCl22 mM DTT) and Stop buffer (100 mM HEPES, pH 7.5 0.015% Brij-35; 0.2% Coating Reag...
Ligand InfoPC cidPC sid
In DepthDetails US Patent
TargetTyrosine-protein kinase ABL1(Homo sapiens (Human))
Inhibikase Therapeutics
US Patent
LigandPNGBDBM481132(US10906896, Cpd 880 | US11725005, Compound 880)
Affinity DataIC50:  203nM. Assay description: Kinase base buffer (50 mM HEPES, pH 7.5 0.0015% Brij-35; 10 mM MgCl22 mM DTT) and Stop buffer (100 mM HEPES, pH 7.5 0.015% Brij-35; 0.2% Coating Reag...
Ligand InfoPC cidPC sid
In DepthDetails US Patent
TargetTyrosine-protein kinase ABL2(Homo sapiens (Human))
Inhibikase Therapeutics
US Patent
LigandPNGBDBM481132(US10906896, Cpd 880 | US11725005, Compound 880)
Affinity DataIC50:  341nM. Assay description: Kinase base buffer (50 mM HEPES, pH 7.5 0.0015% Brij-35; 10 mM MgCl22 mM DTT) and Stop buffer (100 mM HEPES, pH 7.5 0.015% Brij-35; 0.2% Coating Reag...
Ligand InfoPC cidPC sid
In DepthDetails US Patent
TargetTyrosine-protein kinase ABL1(Homo sapiens (Human))
Inhibikase Therapeutics
US Patent
LigandPNGBDBM481132(US10906896, Cpd 880 | US11725005, Compound 880)
Affinity DataIC50:  203nM. Assay description: Kinase base buffer (50 mM HEPES, pH 7.5 0.0015% Brij-35; 10 mM MgCl2 2 mM DTT) and Stop buffer, (100 mM HEPES, pH 7.5 0.015% Brij-35; 0.2% Coating Re...
Ligand InfoPC cidPC sid
In DepthDetails US Patent