BDBM486915 US10947252, Example 382::US11427601, Example 382
SMILES Cc1ccc(cc1CN1C[C@@]2(CCOC2)Oc2ncccc2S1(=O)=O)[C@@H](c1ccn2c(nnc2c1C)C(F)(F)F)C(C)(C)C(O)=O
InChI Key InChIKey=HGCMQDCUCSLDNP-QABMSTFYSA-N
Data  2 Kd
  Tab Delimited (TSV)   2D SDfile   Computed 3D by Vconf -m prep SDfile
Find this compound or compounds like it in BindingDB:
Activity Spreadsheet -- Enzyme Inhibition Constant Data from BindingDB
Found 2 hits for monomerid = 486915
TargetKelch-like ECH-associated protein 1 [321-624](Homo sapiens (Human))
Janssen Pharmaceutica
US Patent
LigandPNGBDBM486915(US10947252, Example 382 | US11427601, Example 382)
Affinity DataKd: <1nM. Assay description: The details of the KEAP1 KELCH ThermoFluorŪ Assay Construct are as follows: Kelch domain of human KEAP 1 (321-624 aa) was used in the assay. The prot...
Ligand InfoPC cidPC sid
TargetKelch-like ECH-associated protein 1/Nuclear factor erythroid 2-related factor 2(Homo sapiens (Human))
Janssen Pharmaceutica
US Patent
LigandPNGBDBM486915(US10947252, Example 382 | US11427601, Example 382)
Affinity DataKd: <1nM. Assay description: The ThermoFluorŪ is a fluorescence based assay (Tf) that estimates ligand binding affinities by measuring the effect of a ligand on protein thermal s...
Ligand InfoPC cidPC sid
In DepthDetails US Patent