BDBM50343530 5,7-dichloro-4-((3-(4-methoxyphenylthio)benzyl)(methyl)amino)quinoline-2-carboxylic acid::CHEMBL1774309
SMILES COc1ccc(Sc2cccc(CN(C)c3cc(nc4cc(Cl)cc(Cl)c34)C(O)=O)c2)cc1
InChI Key InChIKey=FUUIYLWURGZBJB-UHFFFAOYSA-N
Data  1 KI  12 IC50
  Tab Delimited (TSV)   2D SDfile   Computed 3D by Vconf -m prep SDfile
Find this compound or compounds like it in BindingDB:
Activity Spreadsheet -- Enzyme Inhibition Constant Data from BindingDB
Found 13 hits for monomerid = 50343530
TargetTyrosine-protein phosphatase non-receptor type 22(Homo sapiens (Human))
Shandong University
Curated by ChEMBL
LigandPNGBDBM50343530(5,7-dichloro-4-((3-(4-methoxyphenylthio)benzyl)(me...)
Affinity DataKi:  5.53E+3nM. Assay description: Competitive inhibition of N-terminal His-tagged Lyp (unknown origin) catalytic domain (1 to 294 residues) expressed in Escherichia coli BL21 (DE3) as...
In DepthDetails ArticlePubMed
TargetTyrosine-protein phosphatase non-receptor type 5(Homo sapiens (Human))
Shandong University
Curated by ChEMBL
LigandPNGBDBM50343530(5,7-dichloro-4-((3-(4-methoxyphenylthio)benzyl)(me...)
Affinity DataIC50:  6.06E+4nM. Assay description: Inhibition of STEP (unknown origin) assessed as reduction in pNPP hydrolysis
In DepthDetails ArticlePubMed
TargetTyrosine-protein phosphatase non-receptor type 9(Homo sapiens (Human))
Shandong University
Curated by ChEMBL
LigandPNGBDBM50343530(5,7-dichloro-4-((3-(4-methoxyphenylthio)benzyl)(me...)
Affinity DataIC50:  6.61E+4nM. Assay description: Inhibition of MEG2 (unknown origin) assessed as reduction in pNPP hydrolysis
In DepthDetails ArticlePubMed
TargetTyrosine-protein phosphatase non-receptor type 1(Homo sapiens (Human))
Shandong University
Curated by ChEMBL
LigandPNGBDBM50343530(5,7-dichloro-4-((3-(4-methoxyphenylthio)benzyl)(me...)
Affinity DataIC50:  3.88E+4nM. Assay description: Inhibition of PTP1B (unknown origin) assessed as reduction in pNPP hydrolysis
In DepthDetails ArticlePubMed
TargetDual specificity protein phosphatase 3(Homo sapiens (Human))
Shandong University
Curated by ChEMBL
LigandPNGBDBM50343530(5,7-dichloro-4-((3-(4-methoxyphenylthio)benzyl)(me...)
Affinity DataIC50:  5.07E+4nM. Assay description: Inhibition of VHR (unknown origin) assessed as reduction in pNPP hydrolysis
In DepthDetails ArticlePubMed
TargetProtein phosphatase Slingshot homolog 2(Homo sapiens (Human))
Shandong University
Curated by ChEMBL
LigandPNGBDBM50343530(5,7-dichloro-4-((3-(4-methoxyphenylthio)benzyl)(me...)
Affinity DataIC50: >1.00E+5nM. Assay description: Inhibition of SSH2 (unknown origin) assessed as reduction in pNPP hydrolysis
In DepthDetails ArticlePubMed
TargetProstaglandin E synthase(Homo sapiens (Human))
University Of Innsbruck
Curated by ChEMBL
LigandPNGBDBM50343530(5,7-dichloro-4-((3-(4-methoxyphenylthio)benzyl)(me...)
Affinity DataIC50:  3.00E+3nM. Assay description: Inhibition of human microsomal PGES1 in cell-free system assessed as inhibition of conversion of PGH2 to PGE2 by HPLC assay
In DepthDetails ArticlePubMed
TargetProtein phosphatase 1G(Homo sapiens (Human))
Shandong University
Curated by ChEMBL
LigandPNGBDBM50343530(5,7-dichloro-4-((3-(4-methoxyphenylthio)benzyl)(me...)
Affinity DataIC50:  7.48E+4nM. Assay description: Inhibition of PPM1G (unknown origin) assessed as reduction in pNPP hydrolysis
In DepthDetails ArticlePubMed
TargetLysine-specific demethylase 5A(Homo sapiens (Human))
Sichuan University
Curated by ChEMBL
LigandPNGBDBM50343530(5,7-dichloro-4-((3-(4-methoxyphenylthio)benzyl)(me...)
Affinity DataIC50:  3.80E+3nM. Assay description: Inhibition of KDM5A (unknown origin) using substrate peptide/ascorbate/2-OG/ Fe(2) as substrate preincubated for 15 mins followed by addition of subs...
In DepthDetails ArticlePubMed
TargetPolyunsaturated fatty acid 5-lipoxygenase(Homo sapiens (Human))
University Of Innsbruck
Curated by ChEMBL
LigandPNGBDBM50343530(5,7-dichloro-4-((3-(4-methoxyphenylthio)benzyl)(me...)
Affinity DataIC50:  5.20E+3nM. Assay description: Inhibition of human recombinant 5-LO in cell-free system assessed as inhibition of LTB4 production after 10 mins by RP-HPLC assay
In DepthDetails ArticlePubMed
TargetPolyunsaturated fatty acid 5-lipoxygenase(Homo sapiens (Human))
University Of Innsbruck
Curated by ChEMBL
LigandPNGBDBM50343530(5,7-dichloro-4-((3-(4-methoxyphenylthio)benzyl)(me...)
Affinity DataIC50:  850nM. Assay description: Inhibition of 5-LO in human polymorphonuclear leukocytes assessed as inhibition of LTB4 production after 10 mins by RP-HPLC assay
In DepthDetails ArticlePubMed
TargetTyrosine-protein phosphatase non-receptor type 18(Homo sapiens (Human))
Shandong University
Curated by ChEMBL
LigandPNGBDBM50343530(5,7-dichloro-4-((3-(4-methoxyphenylthio)benzyl)(me...)
Affinity DataIC50: >1.00E+5nM. Assay description: Inhibition of PTPN18 (unknown origin) assessed as reduction in pNPP hydrolysis
In DepthDetails ArticlePubMed
TargetProtein phosphatase 1A(Homo sapiens (Human))
Shandong University
Curated by ChEMBL
LigandPNGBDBM50343530(5,7-dichloro-4-((3-(4-methoxyphenylthio)benzyl)(me...)
Affinity DataIC50:  2.10E+4nM. Assay description: Inhibition of PPM1A (unknown origin) assessed as reduction in pNPP hydrolysis
In DepthDetails ArticlePubMed