BDBM50370628 CHEMBL4166276::US10954217, Example 00262
SMILES O=C(OCc1ccccc1)N1CCCc2ccc(cc2C1)N1CCN(CC1)C1CCCC1
InChI Key InChIKey=WYTSVWPGCXSZBN-UHFFFAOYSA-N
Data  4 KI
  Tab Delimited (TSV)   2D SDfile   Computed 3D by Vconf -m prep SDfile
Find this compound or compounds like it in BindingDB:
Activity Spreadsheet -- Enzyme Inhibition Constant Data from BindingDB
Found 4 hits for monomerid = 50370628
TargetSigma intracellular receptor 2(Rattus norvegicus (Rat))
University Of Texas At Austin
Curated by ChEMBL
LigandPNGBDBM50370628(CHEMBL4166276 | US10954217, Example 00262)
Affinity DataKi:  13nM. Assay description: Displacement of [3H]-ditolylguanidine from sigma2 receptor in rat PC12 cells by microbeta scintillation counting method
In DepthDetails ArticlePubMed
TargetSigma intracellular receptor 2(Homo sapiens (Human))
Board Of Regents, The University Of Texas System
US Patent
LigandPNGBDBM50370628(CHEMBL4166276 | US10954217, Example 00262)
Affinity DataKi:  13nM. Assay description: TBD
In DepthDetails US Patent
TargetSigma non-opioid intracellular receptor 1(Homo sapiens (Human))
Board Of Regents, The University Of Texas System
US Patent
LigandPNGBDBM50370628(CHEMBL4166276 | US10954217, Example 00262)
Affinity DataKi:  49nM. Assay description: TBD
In DepthDetails US Patent
TargetSigma non-opioid intracellular receptor 1(Cavia porcellus (Guinea pig))
University Of Texas At Austin
Curated by ChEMBL
LigandPNGBDBM50370628(CHEMBL4166276 | US10954217, Example 00262)
Affinity DataKi:  49nM. Assay description: Displacement of [3H]-Pentazocine from sigma1 receptor in guinea pig brain membrane by microbeta scintillation counting method
In DepthDetails ArticlePubMed