BDBM50466000 CHEMBL4287893
SMILES COc1cc2c3cnc4[nH]ccc4c3n([C@@H]3CCCNC3)c(=O)c2cc1OC
InChI Key InChIKey=MGCBQJWHAMOVKQ-GFCCVEGCSA-N
Data  4 IC50
  Tab Delimited (TSV)   2D SDfile   Computed 3D by Vconf -m prep SDfile
Find this compound or compounds like it in BindingDB:
Activity Spreadsheet -- Enzyme Inhibition Constant Data from BindingDB
Found 4 hits for monomerid = 50466000
TargetNon-receptor tyrosine-protein kinase TYK2(Homo sapiens (Human))
Purdue University
Curated by ChEMBL
LigandPNGBDBM50466000(CHEMBL4287893)
Affinity DataIC50:  45nM. Assay description: Inhibition of TYK2 (unknown origin) preincubated for 20 mins followed by [33P]-ATP addition measured after 2 hrs by filter-binding method
Ligand InfoPC cidPC sid
In DepthDetails ArticlePubMed
TargetTyrosine-protein kinase JAK1(Homo sapiens (Human))
Purdue University
Curated by ChEMBL
LigandPNGBDBM50466000(CHEMBL4287893)
Affinity DataIC50:  5.30nM. Assay description: Inhibition of JAK1 (unknown origin) preincubated for 20 mins followed by [33P]-ATP addition measured after 2 hrs by filter-binding method
Ligand InfoPC cidPC sid
In DepthDetails ArticlePubMed
TargetTyrosine-protein kinase JAK2(Homo sapiens (Human))
Purdue University
Curated by ChEMBL
LigandPNGBDBM50466000(CHEMBL4287893)
Affinity DataIC50:  8.90nM. Assay description: Inhibition of JAK2 (unknown origin) preincubated for 20 mins followed by [33P]-ATP addition measured after 2 hrs by filter-binding method
Ligand InfoPC cidPC sid
In DepthDetails ArticlePubMed
TargetTyrosine-protein kinase JAK3(Homo sapiens (Human))
Purdue University
Curated by ChEMBL
LigandPNGBDBM50466000(CHEMBL4287893)
Affinity DataIC50:  23nM. Assay description: Inhibition of JAK3 (unknown origin) preincubated for 20 mins followed by [33P]-ATP addition measured after 2 hrs by filter-binding method
Ligand InfoPC cidPC sid
In DepthDetails ArticlePubMed