BDBM50508529 CHEMBL4452425
SMILES CN(Cc1cncnc1)S(=O)(=O)c1ccccc1Nc1cc(-c2ccc3ccn(C)c3c2)c2nccnc2c1
InChI Key InChIKey=XTXOJIBMCDCSSE-UHFFFAOYSA-N
Data  2 IC50
  Tab Delimited (TSV)   2D SDfile   Computed 3D by Vconf -m prep SDfile
Find this compound or compounds like it in BindingDB:
Activity Spreadsheet -- Enzyme Inhibition Constant Data from BindingDB
Found 2 hits for monomerid = 50508529
Target6-phosphofructo-2-kinase/fructose-2,6-bisphosphatase 3(Homo sapiens (Human))
Selvita
Curated by ChEMBL
LigandPNGBDBM50508529(CHEMBL4452425)
Affinity DataIC50:  62nM. Assay description: Inhibition of recombinant human His-tagged PFKFB3 expressed in Escherichia coli using fructose-6-phosphate as substrate measured after 2 hrs by ADP-G...
Ligand InfoPC cidPC sid
In DepthDetails ArticlePubMed
Target6-phosphofructo-2-kinase/fructose-2,6-bisphosphatase 3(Homo sapiens (Human))
Selvita
Curated by ChEMBL
LigandPNGBDBM50508529(CHEMBL4452425)
Affinity DataIC50: >1.00E+5nM. Assay description: Inhibition of PFKFB3 in human HCT116 cell lysates assessed as reduction in glycolytic-flux induced fructose-2,6-bisphosphate formation using fructose...
Ligand InfoPC cidPC sid
In DepthDetails ArticlePubMed