BDBM50530254 CHEMBL4475043
SMILES C[C@@H]1OCC2(CCN(CC2)c2cnc3c(n[nH]c3n2)-c2cccc(Cl)c2Cl)[C@@H]1N
InChI Key InChIKey=HNONCNSCKGVMAR-BBATYDOGSA-N
Data  9 IC50
  Tab Delimited (TSV)   2D SDfile   Computed 3D by Vconf -m prep SDfile
Find this compound or compounds like it in BindingDB:
Activity Spreadsheet -- Enzyme Inhibition Constant Data from BindingDB
Found 9 hits for monomerid = 50530254
TargetTyrosine-protein phosphatase non-receptor type 11(Homo sapiens)
Novartis Pharmaceuticals
Curated by ChEMBL
LigandPNGBDBM50530254(CHEMBL4475043)
Affinity DataIC50:  31nM. Assay description: Inhibition of of SHP2 in human KYSE520 cells assessed as suppression of ERK phosphorylation after 2 hrs by AlphaScreen SureFire Phospho-ERK1/2 assay
Ligand InfoPC cidPC sid
In DepthDetails ArticlePubMed
TargetPotassium voltage-gated channel subfamily H member 2(Homo sapiens (Human))
Novartis Pharmaceuticals
Curated by ChEMBL
LigandPNGBDBM50530254(CHEMBL4475043)
Affinity DataIC50:  4nM. Assay description: Inhibition of human ERG by Q-patch assay
Ligand InfoPC cidPC sid
In DepthDetails ArticlePubMed
TargetTyrosine-protein phosphatase non-receptor type 11(Homo sapiens)
Novartis Pharmaceuticals
Curated by ChEMBL
LigandPNGBDBM50530254(CHEMBL4475043)
Affinity DataIC50:  31nM. Assay description: Inhibition of of SHP2 in human KYSE520 cells assessed as suppression of ERK phosphorylation after 2 hrs by AlphaScreen SureFire Phospho-ERK1/2 assay
Ligand InfoPC cidPC sid
In DepthDetails ArticlePubMed
TargetPotassium voltage-gated channel subfamily H member 2(Homo sapiens (Human))
Novartis Pharmaceuticals
Curated by ChEMBL
LigandPNGBDBM50530254(CHEMBL4475043)
Affinity DataIC50:  4nM. Assay description: Inhibition of human ERG by Q-patch assay
Ligand InfoPC cidPC sid
In DepthDetails ArticlePubMed
TargetPotassium voltage-gated channel subfamily H member 2(Homo sapiens (Human))
Novartis Pharmaceuticals
Curated by ChEMBL
LigandPNGBDBM50530254(CHEMBL4475043)
Affinity DataIC50:  100nM. Assay description: Inhibition of hERG ion channel incubated for 3 hrs by fluorescence polarization assay
Ligand InfoPC cidPC sid
In DepthDetails PubMed
TargetTyrosine-protein phosphatase non-receptor type 11(Homo sapiens)
Novartis Pharmaceuticals
Curated by ChEMBL
LigandPNGBDBM50530254(CHEMBL4475043)
Affinity DataIC50:  6nM. Assay description: Inhibition of human 6His-tagged SHP2 (1 to 525 residues) expressed in Escherichia coli BL21 Star (DE3) using DiFMUP as substrate preincubated for 30 ...
Ligand InfoPC cidPC sid
In DepthDetails ArticlePubMed
TargetTyrosine-protein phosphatase non-receptor type 11(Homo sapiens)
Novartis Pharmaceuticals
Curated by ChEMBL
LigandPNGBDBM50530254(CHEMBL4475043)
Affinity DataIC50:  5nM. Assay description: Inhibition of N-terminal his6-tagged wild type recombinant human SHP2 (1 to 597 residues) expressed in Escherichia coli BL21 (DE3) cells using fluoro...
Ligand InfoPC cidPC sid
In DepthDetails PubMed
TargetTyrosine-protein phosphatase non-receptor type 11(Homo sapiens)
Novartis Pharmaceuticals
Curated by ChEMBL
LigandPNGBDBM50530254(CHEMBL4475043)
Affinity DataIC50:  10nM. Assay description: Inhibition of human SHP2 assessed as downregulation of PERK level in human KYSE520 cells incubated for 2 hrs by Alpha screen assay
Ligand InfoPC cidPC sid
In DepthDetails PubMed
TargetTyrosine-protein phosphatase non-receptor type 11(Homo sapiens)
Novartis Pharmaceuticals
Curated by ChEMBL
LigandPNGBDBM50530254(CHEMBL4475043)
Affinity DataIC50:  6nM. Assay description: Inhibition of human 6His-tagged SHP2 (1 to 525 residues) expressed in Escherichia coli BL21 Star (DE3) using DiFMUP as substrate preincubated for 30 ...
Ligand InfoPC cidPC sid
In DepthDetails ArticlePubMed