BDBM52601 4-[3-[(1,3-diketoindan-2-ylidene)methyl]-2,5-dimethyl-pyrrol-1-yl]benzoic acid::4-[3-[(1,3-dioxo-2-indenylidene)methyl]-2,5-dimethyl-1-pyrrolyl]benzoic acid::4-[3-[(1,3-dioxoinden-2-ylidene)methyl]-2,5-dimethylpyrrol-1-yl]benzoic acid::4-[3-[[1,3-bis(oxidanylidene)inden-2-ylidene]methyl]-2,5-dimethyl-pyrrol-1-yl]benzoic acid::4-{3-[(1,3-dioxo-1,3-dihydro-2H-inden-2-ylidene)methyl]-2,5-dimethyl-1H-pyrrol-1-yl}benzoic acid::MLS000689985::SMR000298711::cid_1233277
SMILES [#6]-c1cc(\[#6]=[#6]-2/[#6](=O)-c3ccccc3-[#6]-2=O)c(-[#6])n1-c1ccc(cc1)-[#6](-[#8])=O
InChI Key InChIKey=AYWOBRMNACLWLN-UHFFFAOYSA-N
Data  3 EC50
  Tab Delimited (TSV)   2D SDfile   Computed 3D by Vconf -m prep SDfile
Find this compound or compounds like it in BindingDB:
Activity Spreadsheet -- Enzyme Inhibition Constant Data from BindingDB
Found 3 hits for monomerid = 52601
TargetPOsterior Segregation(Caenorhabditis elegans)
Broad Institute
Curated by PubChem BioAssay
LigandPNGBDBM52601(4-[3-[(1,3-diketoindan-2-ylidene)methyl]-2,5-dimet...)
Affinity DataEC50:  3.00E+5nM. Assay description: Broad Institute: MLPCN maternal gene expression Project ID: 2024 Keywords: Zinc finger, C. elegans, maternal gene expression, RNA-protein interac...
In DepthDetails PCBioAssay
TargetSerine/threonine-protein kinase 33(Homo sapiens (Human))
Broad Institute
Curated by PubChem BioAssay
LigandPNGBDBM52601(4-[3-[(1,3-diketoindan-2-ylidene)methyl]-2,5-dimet...)
Affinity DataEC50:  1.94E+4nM. Assay description: Keywords: STK33 Kinase, Non-ATP Competitive Inhibitor Assay Overview: Purified STK33 Kinase is preincubated with potential inhibitors and allowed to ...
In DepthDetails PCBioAssay
TargetZinc finger protein mex-5(Caenorhabditis elegans)
Broad Institute
Curated by PubChem BioAssay
LigandPNGBDBM52601(4-[3-[(1,3-diketoindan-2-ylidene)methyl]-2,5-dimet...)
Affinity DataEC50:  3.00E+5nM. Assay description: Broad Institute: MLPCN maternal gene expression Project ID: 2024 Keywords: Zinc finger, C. elegans, maternal gene expression, RNA-protein interac...
In DepthDetails PCBioAssay