BDBM54814 4-[(7-chloranyl-4-nitro-2,1,3-benzoxadiazol-5-yl)amino]-1,5-dimethyl-2-phenyl-pyrazol-3-one::4-[(7-chloro-4-nitro-2,1,3-benzoxadiazol-5-yl)amino]-1,5-dimethyl-2-phenyl-1,2-dihydro-3H-pyrazol-3-one::4-[(7-chloro-4-nitro-2,1,3-benzoxadiazol-5-yl)amino]-1,5-dimethyl-2-phenyl-3-pyrazolone::4-[(7-chloro-4-nitro-2,1,3-benzoxadiazol-5-yl)amino]-1,5-dimethyl-2-phenylpyrazol-3-one::4-[(7-chloro-4-nitro-benzofurazan-5-yl)amino]-1,5-dimethyl-2-phenyl-3-pyrazolin-3-one::MLS000678728::SMR000269792::cid_2905495
SMILES Cc1c(Nc2cc(Cl)c3nonc3c2[N+]([O-])=O)c(=O)n(-c2ccccc2)n1C
InChI Key InChIKey=VEBFQFOWBNEFAP-UHFFFAOYSA-N
Data  7 IC50
  Tab Delimited (TSV)   2D SDfile   Computed 3D by Vconf -m prep SDfile
Find this compound or compounds like it in BindingDB:
Activity Spreadsheet -- Enzyme Inhibition Constant Data from BindingDB
Found 7 hits for monomerid = 54814
TargetKappa-type opioid receptor(Homo sapiens (Human))
Burnham Center For Chemical Genomics
Curated by PubChem BioAssay
LigandPNGBDBM54814(4-[(7-chloranyl-4-nitro-2,1,3-benzoxadiazol-5-yl)a...)
Affinity DataIC50:  3.00E+4nM. Assay description: Data Source: Sanford-Burnham Center for Chemical Genomics (SBCCG) Source Affiliation: Sanford-Burnham Medical Research Institute (SBMRI, San Diego, C...
In DepthDetails PCBioAssay
TargetG-protein coupled receptor 55(Homo sapiens (Human))
Burnham Center For Chemical Genomics
Curated by PubChem BioAssay
LigandPNGBDBM54814(4-[(7-chloranyl-4-nitro-2,1,3-benzoxadiazol-5-yl)a...)
Affinity DataIC50:  3.48E+3nM. Assay description: Data Source: Sanford-Burnham Center for Chemical Genomics (SBCCG) Source Affiliation: Sanford-Burnham Medical Research Institute (SBMRI, San Diego, C...
In DepthDetails PCBioAssay
TargetKappa-type opioid receptor(Homo sapiens (Human))
Burnham Center For Chemical Genomics
Curated by PubChem BioAssay
LigandPNGBDBM54814(4-[(7-chloranyl-4-nitro-2,1,3-benzoxadiazol-5-yl)a...)
Affinity DataIC50:  4.14E+3nM. Assay description: Data Source: Sanford-Burnham Center for Chemical Genomics (SBCCG) Source Affiliation: Sanford-Burnham Medical Research Institute (SBMRI, San Diego, C...
In DepthDetails PCBioAssay
TargetBeta-lactamase(Pseudomonas aeruginosa)
The Scripps Research Institute Molecular Screening Center
Curated by PubChem BioAssay
LigandPNGBDBM54814(4-[(7-chloranyl-4-nitro-2,1,3-benzoxadiazol-5-yl)a...)
Affinity DataIC50:  6.00E+3nM. Assay description: Source (MLPCN Center Name): The Scripps Research Institute Molecular Screening Center (SRIMSC) Affiliation: The Scripps Research Institute, TSRI Assa...
In DepthDetails PCBioAssay
TargetType-1 angiotensin II receptor(Homo sapiens (Human))
Burnham Center For Chemical Genomics
Curated by PubChem BioAssay
LigandPNGBDBM54814(4-[(7-chloranyl-4-nitro-2,1,3-benzoxadiazol-5-yl)a...)
Affinity DataIC50:  2.33E+3nM. Assay description: Data Source: Sanford-Burnham Center for Chemical Genomics (SBCCG) Source Affiliation: Sanford-Burnham Medical Research Institute(SBMRI, San Diego, C...
In DepthDetails PCBioAssay
TargetToll-like receptor 9(Homo sapiens (Human))
The Scripps Research Institute Molecular Screening Center
Curated by PubChem BioAssay
LigandPNGBDBM54814(4-[(7-chloranyl-4-nitro-2,1,3-benzoxadiazol-5-yl)a...)
Affinity DataIC50:  4.31E+3nM. Assay description: Source (MLPCN Center Name): The Scripps Research Institute Molecular Screening Center (SRIMSC) Affiliation: The Scripps Research Institute, TSRI Assa...
In DepthDetails PCBioAssay
TargetApelin receptor(Homo sapiens (Human))
Sanford-Burnham Center For Chemical Genomics
Curated by PubChem BioAssay
LigandPNGBDBM54814(4-[(7-chloranyl-4-nitro-2,1,3-benzoxadiazol-5-yl)a...)
Affinity DataIC50:  2.46E+3nM. Assay description: Data Source: Sanford-Burnham Center for Chemical Genomics (SBCCG) Source Affiliation: Sanford- Sanford-Burnham Medical Research Institute(SBMRI, San...
In DepthDetails PCBioAssay